BDBM41051 3-Amino-6-thiophen-2-yl-thieno[2,3-b]pyridine-2-carboxylic acid benzothiazol-2-ylamide::3-amino-N-(1,3-benzothiazol-2-yl)-6-(2-thienyl)thieno[2,3-b]pyridine-2-carboxamide::3-amino-N-(1,3-benzothiazol-2-yl)-6-thiophen-2-yl-2-thieno[2,3-b]pyridinecarboxamide::3-amino-N-(1,3-benzothiazol-2-yl)-6-thiophen-2-ylthieno[2,3-b]pyridine-2-carboxamide::3-azanyl-N-(1,3-benzothiazol-2-yl)-6-thiophen-2-yl-thieno[2,3-b]pyridine-2-carboxamide::MLS000556593::SMR000147910::cid_1928929
SMILES Nc1c(sc2nc(ccc12)-c1cccs1)C(=O)Nc1nc2ccccc2s1
InChI Key InChIKey=WVHBEUUJHVJCPR-UHFFFAOYSA-N
Data  7 IC50  3 EC50
  Tab Delimited (TSV)   2D SDfile   Computed 3D by Vconf -m prep SDfile
Find this compound or compounds like it in BindingDB:
Activity Spreadsheet -- Enzyme Inhibition Constant Data from BindingDB
Found 10 hits for monomerid = 41051
TargetFocal adhesion kinase 1(Homo sapiens (Human))
The Scripps Research Institute Molecular Screening Center
Curated by PubChem BioAssay
LigandPNGBDBM41051(3-Amino-6-thiophen-2-yl-thieno[2,3-b]pyridine-2-ca...)
Affinity DataIC50:  1.19E+4nM. Assay description: Source (MLSCN Center Name): The Scripps Research Institute Molecular Screening Center Center Affiliation: The Scripps Research Institute, TSRI Assa...
In DepthDetails PCBioAssay
TargetProtein-tyrosine kinase 2-beta(Homo sapiens (Human))
The Scripps Research Institute Molecular Screening Center
Curated by PubChem BioAssay
LigandPNGBDBM41051(3-Amino-6-thiophen-2-yl-thieno[2,3-b]pyridine-2-ca...)
Affinity DataIC50:  6.73E+3nM. Assay description: Source (MLPCN Center Name): The Scripps Research Institute Molecular Screening Center (SRIMSC) Affiliation: The Scripps Research Institute, TSRI Assa...
In DepthDetails PCBioAssay
TargetPOsterior Segregation(Caenorhabditis elegans)
Broad Institute
Curated by PubChem BioAssay
LigandPNGBDBM41051(3-Amino-6-thiophen-2-yl-thieno[2,3-b]pyridine-2-ca...)
Affinity DataEC50:  1.92E+4nM. Assay description: Broad Institute: MLPCN maternal gene expression Project ID: 2024 Keywords: Zinc finger, C. elegans, maternal gene expression, RNA-protein interac...
In DepthDetails PCBioAssay
TargetZinc finger protein mex-5(Caenorhabditis elegans)
Broad Institute
Curated by PubChem BioAssay
LigandPNGBDBM41051(3-Amino-6-thiophen-2-yl-thieno[2,3-b]pyridine-2-ca...)
Affinity DataEC50:  1.50E+5nM. Assay description: Broad Institute: MLPCN maternal gene expression Project ID: 2024 Keywords: Zinc finger, C. elegans, maternal gene expression, RNA-protein interac...
In DepthDetails PCBioAssay
TargetBeta-lactamase(Pseudomonas aeruginosa)
The Scripps Research Institute Molecular Screening Center
Curated by PubChem BioAssay
LigandPNGBDBM41051(3-Amino-6-thiophen-2-yl-thieno[2,3-b]pyridine-2-ca...)
Affinity DataIC50:  3.93E+3nM. Assay description: Source (MLPCN Center Name): The Scripps Research Institute Molecular Screening Center (SRIMSC) Affiliation: The Scripps Research Institute, TSRI Assa...
In DepthDetails PCBioAssay
TargetDNA damage-inducible transcript 3 protein(Mus musculus)
Emory University
Curated by PubChem BioAssay
LigandPNGBDBM41051(3-Amino-6-thiophen-2-yl-thieno[2,3-b]pyridine-2-ca...)
Affinity DataIC50: >1.00E+4nM. Assay description: NIH Molecular Libraries Screening Centers Network [MLSCN] Emory Chemical Biology Discovery Center in MLSCN Assay provider: Dr. Randal Kaufman, Univer...
In DepthDetails PCBioAssay
TargetX-box-binding protein 1(Homo sapiens (Human))
Emory University
Curated by PubChem BioAssay
LigandPNGBDBM41051(3-Amino-6-thiophen-2-yl-thieno[2,3-b]pyridine-2-ca...)
Affinity DataIC50:  1.00E+4nM. Assay description: NIH Molecular Libraries Screening Centers Network [MLSCN] Emory Chemical Biology Discovery Center in MLSCN Assay provider: Dr. Randal Kaufman, Univer...
In DepthDetails PCBioAssay
TargetDNA damage-inducible transcript 3 protein(Mus musculus)
Emory University
Curated by PubChem BioAssay
LigandPNGBDBM41051(3-Amino-6-thiophen-2-yl-thieno[2,3-b]pyridine-2-ca...)
Affinity DataIC50: >1.00E+4nM. Assay description: NIH Molecular Libraries Screening Centers Network [MLSCN] Emory Chemical Biology Discovery Center in MLSCN Assay provider: Dr. Randal Kaufman, Univer...
In DepthDetails PCBioAssay
TargetToll-like receptor 9(Homo sapiens (Human))
The Scripps Research Institute Molecular Screening Center
Curated by PubChem BioAssay
LigandPNGBDBM41051(3-Amino-6-thiophen-2-yl-thieno[2,3-b]pyridine-2-ca...)
Affinity DataIC50:  5.89E+3nM. Assay description: Source (MLPCN Center Name): The Scripps Research Institute Molecular Screening Center (SRIMSC) Affiliation: The Scripps Research Institute, TSRI Assa...
In DepthDetails PCBioAssay
TargetStreptokinase A(Streptococcus pyogenes M1 GAS)
Broad Institute
Curated by PubChem BioAssay
LigandPNGBDBM41051(3-Amino-6-thiophen-2-yl-thieno[2,3-b]pyridine-2-ca...)
Affinity DataEC50:  1.50E+5nM. Assay description: Keywords: Group A streptococcus, GAS, streptokinase, expression, virulence, inhibition, dose response, EC50 Assay Overview: The goal of this assa...
In DepthDetails PCBioAssay