BDBM41087 MLS000555365::N-[4-[[2-(4-acetamidoanilino)-5-nitro-4-pyrimidinyl]amino]phenyl]acetamide::N-[4-[[2-(4-acetamidoanilino)-5-nitro-pyrimidin-4-yl]amino]phenyl]acetamide::N-[4-[[2-(4-acetamidoanilino)-5-nitropyrimidin-4-yl]amino]phenyl]acetamide::N-[4-[[2-[(4-acetamidophenyl)amino]-5-nitro-pyrimidin-4-yl]amino]phenyl]ethanamide::N-{4-[2-(4-Acetylamino-phenylamino)-5-nitro-pyrimidin-4-ylamino]-phenyl}-acetamide::SMR000174046::cid_3094436
SMILES CC(=O)Nc1ccc(Nc2ncc(c(Nc3ccc(NC(C)=O)cc3)n2)[N+]([O-])=O)cc1
InChI Key InChIKey=HNJBGZILIPINTO-UHFFFAOYSA-N
Data  3 IC50
  Tab Delimited (TSV)   2D SDfile   Computed 3D by Vconf -m prep SDfile
Find this compound or compounds like it in BindingDB:
Activity Spreadsheet -- Enzyme Inhibition Constant Data from BindingDB
Found 3 hits for monomerid = 41087
TargetFocal adhesion kinase 1(Homo sapiens (Human))
The Scripps Research Institute Molecular Screening Center
Curated by PubChem BioAssay
LigandPNGBDBM41087(MLS000555365 | N-[4-[[2-(4-acetamidoanilino)-5-nit...)
Affinity DataIC50:  2.04E+3nM. Assay description: Source (MLSCN Center Name): The Scripps Research Institute Molecular Screening Center Center Affiliation: The Scripps Research Institute, TSRI Assa...
In DepthDetails PCBioAssay
TargetProtein-tyrosine kinase 2-beta(Homo sapiens (Human))
The Scripps Research Institute Molecular Screening Center
Curated by PubChem BioAssay
LigandPNGBDBM41087(MLS000555365 | N-[4-[[2-(4-acetamidoanilino)-5-nit...)
Affinity DataIC50:  2.44E+3nM. Assay description: Source (MLPCN Center Name): The Scripps Research Institute Molecular Screening Center (SRIMSC) Affiliation: The Scripps Research Institute, TSRI Assa...
In DepthDetails PCBioAssay
TargetInduced myeloid leukemia cell differentiation protein Mcl-1(Homo sapiens (Human))
Emory University
Curated by PubChem BioAssay
LigandPNGBDBM41087(MLS000555365 | N-[4-[[2-(4-acetamidoanilino)-5-nit...)
Affinity DataIC50:  7.68E+3nM. Assay description: NIH Molecular Libraries Screening Centers Network [MLSCN] Emory Chemical Biology Discovery Center in MLSCN Assay provider: Nikolovska-Coleska, Univer...
In DepthDetails PCBioAssay