BDBM41118 MLS000050960::N-(1,3-benzodioxol-5-yl)-4-methyl-3-(1-piperidinylsulfonyl)benzamide::N-(1,3-benzodioxol-5-yl)-4-methyl-3-piperidin-1-ylsulfonyl-benzamide::N-(1,3-benzodioxol-5-yl)-4-methyl-3-piperidin-1-ylsulfonylbenzamide::N-(1,3-benzodioxol-5-yl)-4-methyl-3-piperidinosulfonyl-benzamide::N-1,3-benzodioxol-5-yl-4-methyl-3-(1-piperidinylsulfonyl)benzamide::SMR000078695::cid_1248970
SMILES Cc1ccc(cc1S(=O)(=O)N1CCCCC1)C(=O)Nc1ccc2OCOc2c1
InChI Key InChIKey=ZTLVFKXPNBWNLE-UHFFFAOYSA-N
Data  3 IC50  1 EC50
  Tab Delimited (TSV)   2D SDfile   Computed 3D by Vconf -m prep SDfile
Find this compound or compounds like it in BindingDB:
Activity Spreadsheet -- Enzyme Inhibition Constant Data from BindingDB
Found 4 hits for monomerid = 41118
TargetCathepsin B(Homo sapiens (Human))
Pcmd
Curated by PubChem BioAssay
LigandPNGBDBM41118(MLS000050960 | N-(1,3-benzodioxol-5-yl)-4-methyl-3...)
Affinity DataIC50: >5.00E+4nM. Assay description: Screening Center: Penn Center for Molecular Discovery Center Affiliation: University of Pennsylvania Network: Molecular Library Screening Center Netw...
In DepthDetails PCBioAssay
TargetVoltage-dependent T-type calcium channel subunit alpha-1H(Homo sapiens (Human))
Vanderbilt Screening Center For Gpcrs, Ion Channels And Transporters
Curated by PubChem BioAssay
LigandPNGBDBM41118(MLS000050960 | N-(1,3-benzodioxol-5-yl)-4-methyl-3...)
Affinity DataEC50:  4.78E+3nM. Assay description: Assay Provider: Xinmin Xie Assay Provider Affiliation: Bioscience Division, SRI International, Menlo Park, CA Grant Title: HTS Assay for Cav3 T-Type ...
In DepthDetails PCBioAssay
TargetProcathepsin L(Homo sapiens (Human))
Pcmd
Curated by PubChem BioAssay
LigandPNGBDBM41118(MLS000050960 | N-(1,3-benzodioxol-5-yl)-4-methyl-3...)
Affinity DataIC50: >5.00E+4nM. Assay description: Screening Center: Penn Center for Molecular Discovery Center Affiliation: University of Pennsylvania Network: Molecular Library Screening Center Netw...
In DepthDetails PCBioAssay
TargetCathepsin S(Homo sapiens (Human))
Pcmd
Curated by PubChem BioAssay
LigandPNGBDBM41118(MLS000050960 | N-(1,3-benzodioxol-5-yl)-4-methyl-3...)
Affinity DataIC50: >5.00E+4nM. Assay description: Screening Center: Penn Center for Molecular Discovery Center Affiliation: University of Pennsylvania Network: Molecular Library Screening Center Netw...
In DepthDetails PCBioAssay