BDBM41119 3-methyl-6-(4-pyridin-2-ylpiperazin-1-yl)-[1,2,4]triazolo[4,3-b]pyridazine::3-methyl-6-[4-(2-pyridinyl)-1-piperazinyl]-[1,2,4]triazolo[4,3-b]pyridazine::3-methyl-6-[4-(2-pyridyl)piperazino]-[1,2,4]triazolo[4,3-b]pyridazine::MLS000119337::SMR000096258::cid_5308432
SMILES Cc1nnc2ccc(nn12)N1CCN(CC1)c1ccccn1
InChI Key InChIKey=ZBRKJJWBNRSLSP-UHFFFAOYSA-N
Data  2 IC50
  Tab Delimited (TSV)   2D SDfile   Computed 3D by Vconf -m prep SDfile
Find this compound or compounds like it in BindingDB:
Activity Spreadsheet -- Enzyme Inhibition Constant Data from BindingDB
Found 2 hits for monomerid = 41119
TargetProcathepsin L(Homo sapiens (Human))
Pcmd
Curated by PubChem BioAssay
LigandPNGBDBM41119(3-methyl-6-(4-pyridin-2-ylpiperazin-1-yl)-[1,2,4]t...)
Affinity DataIC50: >5.00E+4nM. Assay description: Screening Center: Penn Center for Molecular Discovery Center Affiliation: University of Pennsylvania Network: Molecular Library Screening Center Netw...
In DepthDetails PCBioAssay
TargetCathepsin B(Homo sapiens (Human))
Pcmd
Curated by PubChem BioAssay
LigandPNGBDBM41119(3-methyl-6-(4-pyridin-2-ylpiperazin-1-yl)-[1,2,4]t...)
Affinity DataIC50: >5.00E+4nM. Assay description: Screening Center: Penn Center for Molecular Discovery Center Affiliation: University of Pennsylvania Network: Molecular Library Screening Center Netw...
In DepthDetails PCBioAssay