BDBM411494 US10392376, Example 46a::US10392376, Example 46b::US10800769, Example 46b::US11434233, Example 46a
SMILES C[C@@H]1COCCN1c1cc(N=[S@](C)(=O)C2CC2)nc(n1)-c1ccnc2[nH]ccc12
InChI Key
Data  7 IC50
  Tab Delimited (TSV)   2D SDfile   Computed 3D by Vconf -m prep SDfile
Find this compound or compounds like it in BindingDB:
Activity Spreadsheet -- Enzyme Inhibition Constant Data from BindingDB
Found 7 hits for monomerid = 411494
TargetATR-interacting protein/Serine/threonine-protein kinase ATR(Homo sapiens (Human))
Board Of Regents, The University Of Texas System
US Patent
LigandPNGBDBM411494(US10392376, Example 46a | US10392376, Example 46b ...)
Affinity DataIC50:  8nM. Assay description: Human full-length FLAG-TEV-ATR and His6-ATRIP were co-expressed in HEK293 cells. The cell pellet (20 g) was harvested and lysed in 100 mL of lysis bu...
Ligand Info
In DepthDetails US Patent
TargetATR-interacting protein/Serine/threonine-protein kinase ATR(Homo sapiens (Human))
Board Of Regents, The University Of Texas System
US Patent
LigandPNGBDBM411494(US10392376, Example 46a | US10392376, Example 46b ...)
Affinity DataIC50:  1nM. Assay description: Human full-length FLAG-TEV-ATR and His6-ATRIP were co-expressed in HEK293 cells. The cell pellet (20 g) was harvested and lysed in 100 mL of lysis bu...
Ligand Info
In DepthDetails US Patent
TargetATR-interacting protein/Serine/threonine-protein kinase ATR(Homo sapiens (Human))
Board Of Regents, The University Of Texas System
US Patent
LigandPNGBDBM411494(US10392376, Example 46a | US10392376, Example 46b ...)
Affinity DataIC50:  8nM. Assay description: Human full-length FLAG-TEV-ATR and His6-ATRIP were co-expressed in HEK293 cells. The cell pellet (20 g) was harvested and lysed in 100 mL of lysis bu...
Ligand Info
In DepthDetails US Patent
TargetATR-interacting protein/Serine/threonine-protein kinase ATR(Homo sapiens (Human))
Board Of Regents, The University Of Texas System
US Patent
LigandPNGBDBM411494(US10392376, Example 46a | US10392376, Example 46b ...)
Affinity DataIC50:  8nM. Assay description: Human full-length FLAG-TEV-ATR and His6-ATRIP were co-expressed in HEK293 cells. The cell pellet (20 g) was harvested and lysed in 100 mL of lysis bu...
Ligand Info
In DepthDetails US Patent
TargetATR-interacting protein/Serine/threonine-protein kinase ATR(Homo sapiens (Human))
Board Of Regents, The University Of Texas System
US Patent
LigandPNGBDBM411494(US10392376, Example 46a | US10392376, Example 46b ...)
Affinity DataIC50:  1nM. Assay description: Human full-length FLAG-TEV-ATR and His6-ATRIP were co-expressed in HEK293 cells. The cell pellet (20 g) was harvested and lysed in 100 mL of lysis bu...
Ligand Info
In DepthDetails US Patent
TargetSerine/threonine-protein kinase Chk1(Homo sapiens (Human))
Board Of Regents, The University Of Texas System
US Patent
LigandPNGBDBM411494(US10392376, Example 46a | US10392376, Example 46b ...)
Affinity DataIC50:  8nM. Assay description: Inhibitors of ATR kinase are effective at inhibiting the ATR-driven phosphorylation of the downstream target Chk1 kinase at Serine 345, following the...
Ligand Info
In DepthDetails US Patent
TargetSerine/threonine-protein kinase Chk1(Homo sapiens (Human))
Board Of Regents, The University Of Texas System
US Patent
LigandPNGBDBM411494(US10392376, Example 46a | US10392376, Example 46b ...)
Affinity DataIC50:  179nM. Assay description: Inhibitors of ATR kinase are effective at inhibiting the ATR-driven phosphorylation of the downstream target Chk1 kinase at Serine 345, following the...
Ligand Info
In DepthDetails US Patent