BDBM411880 US10392391, Compound I-O-25::US10787452, Compound I-O-25::US11117900, Compound I-O-25::US11370798, Cmpd. # I-O-25::US20230271963, Compound I-O-25
SMILES Nc1nn2cc(CC#N)cnc2c1C(=O)Nc1cnccc1Oc1ccccc1
InChI Key InChIKey=BGENDINFKJRMGI-UHFFFAOYSA-N
Data  5 KI
  Tab Delimited (TSV)   2D SDfile   Computed 3D by Vconf -m prep SDfile
Find this compound or compounds like it in BindingDB:
Activity Spreadsheet -- Enzyme Inhibition Constant Data from BindingDB
Found 5 hits for monomerid = 411880
TargetSerine/threonine-protein kinase ATR(Homo sapiens (Human))
Vertex Pharmaceuticals
US Patent
LigandPNGBDBM411880(US10392391, Compound I-O-25 | US10787452, Compound...)
Affinity DataKi: <10nM. Assay description: Compounds were screened for their ability to inhibit ATR kinase using a radioactive-phosphate incorporation assay. Assays were carried out in a mixtu...
Ligand Info
In DepthDetails US Patent
TargetSerine/threonine-protein kinase ATR(Homo sapiens (Human))
Vertex Pharmaceuticals
US Patent
LigandPNGBDBM411880(US10392391, Compound I-O-25 | US10787452, Compound...)
Affinity DataKi: <10nM. Assay description: Assays were carried out at 25° C. in the presence of 5 nM full-length ATR. An assay stock buffer solution was prepared containing all of the reagents...
Ligand Info
In DepthDetails US Patent
TargetSerine/threonine-protein kinase ATR(Homo sapiens (Human))
Vertex Pharmaceuticals
US Patent
LigandPNGBDBM411880(US10392391, Compound I-O-25 | US10787452, Compound...)
Affinity DataKi: <10nM. Assay description: Compounds were screened for their ability to inhibit ATR kinase using a radioactive-phosphate incorporation assay. Assays were carried out in a mixtu...
Ligand Info
In DepthDetails US Patent
TargetSerine/threonine-protein kinase ATR(Homo sapiens (Human))
Vertex Pharmaceuticals
US Patent
LigandPNGBDBM411880(US10392391, Compound I-O-25 | US10787452, Compound...)
Affinity DataKi: <100nM. Assay description: Table 5: Compounds were screened for their ability to inhibit ATR kinase using a radioactive-phosphate incorporation assay. Assays were carried out i...
Ligand Info
In DepthDetails US Patent
TargetSerine/threonine-protein kinase ATR(Homo sapiens (Human))
Vertex Pharmaceuticals
US Patent
LigandPNGBDBM411880(US10392391, Compound I-O-25 | US10787452, Compound...)
Affinity DataKi:  600nM. Assay description: Compounds were screened for their ability to inhibit ATR kinase using a radioactive-phosphate incorporation assay. Assays were carried out in a mixtu...
Ligand Info
In DepthDetails US Patent