BDBM41215 4-[2-(4-methylquinolin-2-yl)oxyethyl]morpholine;hydrochloride::4-[2-[(4-methyl-2-quinolinyl)oxy]ethyl]morpholine;hydrochloride::4-[2-[(4-methyl-2-quinolyl)oxy]ethyl]morpholine;hydrochloride::MLS000071512::SMR000041621::cid_2958972
SMILES Cc1cc(OCCN2CCOCC2)nc2ccccc12
InChI Key InChIKey=OKFCLCXSRLOWBL-UHFFFAOYSA-N
Data  1 IC50
  Tab Delimited (TSV)   2D SDfile   Computed 3D by Vconf -m prep SDfile
Find this compound or compounds like it in BindingDB:
Activity Spreadsheet -- Enzyme Inhibition Constant Data from BindingDB
Found 1 hit for monomerid = 41215
TargetDNA-directed RNA polymerase subunit beta(Escherichia coli)
Pcmd
Curated by PubChem BioAssay
LigandPNGBDBM41215(4-[2-(4-methylquinolin-2-yl)oxyethyl]morpholine;hy...)
Affinity DataIC50: >5.00E+4nM. Assay description: Screening Center: Penn Center for Molecular Discovery Center Affiliation: University of Pennsylvania Network: Molecular Library Screening Center Netw...
In DepthDetails PCBioAssay