BDBM412269 US10399945, Example 8::US10669239, Compound 8::US10927079, Compound 8
SMILES Cc1cc(NC(=O)N[C@H]2[C@H](O)CC(C)(C)c3ccccc23)c(nc1CO)-c1ccccc1
InChI Key InChIKey=VUSMQIDXIQVLTB-ISKFKSNPSA-N
Data  3 IC50
  Tab Delimited (TSV)   2D SDfile   Computed 3D by Vconf -m prep SDfile
Find this compound or compounds like it in BindingDB:
Activity Spreadsheet -- Enzyme Inhibition Constant Data from BindingDB
Found 3 hits for monomerid = 412269
TargetHigh affinity nerve growth factor receptor(Homo sapiens (Human))
Mochida Pharmaceutical
US Patent
LigandPNGBDBM412269(US10399945, Example 8 | US10669239, Compound 8 | U...)
Affinity DataIC50: <50nM. Assay description: Measurement was carried out using TrkA LanthaScreen (registered trademark) Eu Kinase Binding Assay (ThermoFisher SCIENTIFIC). To a 384 well plate (Co...
Ligand Info
In DepthDetails US Patent
TargetHigh affinity nerve growth factor receptor(Homo sapiens (Human))
Mochida Pharmaceutical
US Patent
LigandPNGBDBM412269(US10399945, Example 8 | US10669239, Compound 8 | U...)
Affinity DataIC50: <0.100nM. Assay description: Measurement was carried out using TrkA LanthaScreen (registered trademark) Eu Kinase Binding Assay (ThermoFisher SCIENTIFIC). To a 384 well plate (Co...
Ligand Info
In DepthDetails US Patent
TargetHigh affinity nerve growth factor receptor(Homo sapiens (Human))
Mochida Pharmaceutical
US Patent
LigandPNGBDBM412269(US10399945, Example 8 | US10669239, Compound 8 | U...)
Affinity DataIC50: <50nM. Assay description: Measurement was carried out using TrkA LanthaScreen (registered trademark) Eu Kinase Binding Assay (ThermoFisher SCIENTIFIC). To a 384 well plate (Co...
Ligand Info
In DepthDetails US Patent