BDBM41240 MLS000094184::N-(6-imidazo[2,1-b]thiazolylmethyl)-3-(trifluoromethyl)benzamide::N-(imidazo[2,1-b][1,3]thiazol-6-ylmethyl)-3-(trifluoromethyl)benzamide::N-(imidazo[2,1-b]thiazol-6-ylmethyl)-3-(trifluoromethyl)benzamide::SMR000029780::cid_3241089
SMILES FC(F)(F)c1cccc(c1)C(=O)NCc1cn2ccsc2n1
InChI Key InChIKey=DARCXEZMYHVZEV-UHFFFAOYSA-N
Data  1 IC50
  Tab Delimited (TSV)   2D SDfile   Computed 3D by Vconf -m prep SDfile
Find this compound or compounds like it in BindingDB:
Activity Spreadsheet -- Enzyme Inhibition Constant Data from BindingDB
Found 1 hit for monomerid = 41240
TargetDNA-directed RNA polymerase subunit beta(Escherichia coli)
Pcmd
Curated by PubChem BioAssay
LigandPNGBDBM41240(MLS000094184 | N-(6-imidazo[2,1-b]thiazolylmethyl)...)
Affinity DataIC50: >5.00E+4nM. Assay description: Screening Center: Penn Center for Molecular Discovery Center Affiliation: University of Pennsylvania Network: Molecular Library Screening Center Netw...
Ligand InfoPC cidPC sid
In DepthDetails PCBioAssay