BDBM41247 4-(4-isopropoxyphenyl)-1,3,4,6,7,8-hexahydroquinoline-2,5-quinone::4-(4-isopropoxyphenyl)-4,6,7,8-tetrahydroquinoline-2,5(1H,3H)-dione::4-(4-propan-2-yloxyphenyl)-1,3,4,6,7,8-hexahydroquinoline-2,5-dione::MLS000090944::SMR000025547::cid_3162449
SMILES CC(C)Oc1ccc(cc1)C1CC(=O)NC2=C1C(=O)CCC2
InChI Key InChIKey=ZVPOLVCBBHBLRW-UHFFFAOYSA-N
Data  1 IC50
  Tab Delimited (TSV)   2D SDfile   Computed 3D by Vconf -m prep SDfile
Find this compound or compounds like it in BindingDB:
Activity Spreadsheet -- Enzyme Inhibition Constant Data from BindingDB
Found 1 hit for monomerid = 41247
TargetDNA-directed RNA polymerase subunit beta(Escherichia coli)
Pcmd
Curated by PubChem BioAssay
LigandPNGBDBM41247(4-(4-isopropoxyphenyl)-1,3,4,6,7,8-hexahydroquinol...)
Affinity DataIC50: >5.00E+4nM. Assay description: Screening Center: Penn Center for Molecular Discovery Center Affiliation: University of Pennsylvania Network: Molecular Library Screening Center Netw...
In DepthDetails PCBioAssay