BDBM41264 5-(4-methylbenzyl)-3H-pyridazin[4,5-b]indol-4-one::5-[(4-methylphenyl)methyl]-3H-pyridazino[4,5-b]indol-4-one::MLS000119675::SMR000096596::cid_6324547
SMILES Cc1ccc(Cn2c3ccccc3c3cn[nH]c(=O)c23)cc1
InChI Key InChIKey=LTVXVRZXFLIBDO-UHFFFAOYSA-N
Data  1 IC50
  Tab Delimited (TSV)   2D SDfile   Computed 3D by Vconf -m prep SDfile
Find this compound or compounds like it in BindingDB:
Activity Spreadsheet -- Enzyme Inhibition Constant Data from BindingDB
Found 1 hit for monomerid = 41264
TargetDNA-directed RNA polymerase subunit beta(Escherichia coli)
Pcmd
Curated by PubChem BioAssay
LigandPNGBDBM41264(5-(4-methylbenzyl)-3H-pyridazin[4,5-b]indol-4-one ...)
Affinity DataIC50: >5.00E+4nM. Assay description: Screening Center: Penn Center for Molecular Discovery Center Affiliation: University of Pennsylvania Network: Molecular Library Screening Center Netw...
In DepthDetails PCBioAssay