BDBM41267 MLS000118110::N-[3-(dipropylamino)propyl]-1,5-dimethyl-4-oxidanylidene-pyrrolo[3,2-c]quinoline-2-carboxamide::N-[3-(dipropylamino)propyl]-1,5-dimethyl-4-oxo-2-pyrrolo[3,2-c]quinolinecarboxamide::N-[3-(dipropylamino)propyl]-1,5-dimethyl-4-oxopyrrolo[3,2-c]quinoline-2-carboxamide::N-[3-(dipropylamino)propyl]-4-keto-1,5-dimethyl-pyrrolo[3,2-c]quinoline-2-carboxamide::SMR000095058::cid_5309618
SMILES CCCN(CCC)CCCNC(=O)c1cc2c(n1C)c1ccccc1n(C)c2=O
InChI Key InChIKey=KPABNCNZBWNRSC-UHFFFAOYSA-N
Data  1 IC50
  Tab Delimited (TSV)   2D SDfile   Computed 3D by Vconf -m prep SDfile
Find this compound or compounds like it in BindingDB:
Activity Spreadsheet -- Enzyme Inhibition Constant Data from BindingDB
Found 1 hit for monomerid = 41267
TargetDNA-directed RNA polymerase subunit beta(Escherichia coli)
Pcmd
Curated by PubChem BioAssay
LigandPNGBDBM41267(MLS000118110 | N-[3-(dipropylamino)propyl]-1,5-dim...)
Affinity DataIC50: >5.00E+4nM. Assay description: Screening Center: Penn Center for Molecular Discovery Center Affiliation: University of Pennsylvania Network: Molecular Library Screening Center Netw...
In DepthDetails PCBioAssay