BDBM41277 1-(1-adamantyl)-3-(3-morpholin-4-ylpropyl)urea::1-(1-adamantyl)-3-(3-morpholinopropyl)urea::1-(1-adamantyl)-3-[3-(4-morpholinyl)propyl]urea::MLS000108081::SMR000104044::cid_2864086
SMILES [H]C12CC3([H])CC([H])(C1)CC(C2)(C3)NC(=O)NCCCN1CCOCC1
InChI Key InChIKey=WGVZKAJAISJASD-UHFFFAOYSA-N
Data  2 IC50
  Tab Delimited (TSV)   2D SDfile   Computed 3D by Vconf -m prep SDfile
Find this compound or compounds like it in BindingDB:
Activity Spreadsheet -- Enzyme Inhibition Constant Data from BindingDB
Found 2 hits for monomerid = 41277
TargetBifunctional epoxide hydrolase 2(Homo sapiens (Human))
Colorado State University
Curated by ChEMBL
LigandPNGBDBM41277(1-(1-adamantyl)-3-(3-morpholin-4-ylpropyl)urea | 1...)
Affinity DataIC50:  610nM. Assay description: Inhibition of human recombinant soluble epoxide hydrolase using CMNPC as substrate assessed as appearance of 6-methoxy-2-naphthaldehyde after 10 mins...
In DepthDetails ArticlePubMed
TargetDNA-directed RNA polymerase subunit beta(Escherichia coli)
Pcmd
Curated by PubChem BioAssay
LigandPNGBDBM41277(1-(1-adamantyl)-3-(3-morpholin-4-ylpropyl)urea | 1...)
Affinity DataIC50: >5.00E+4nM. Assay description: Screening Center: Penn Center for Molecular Discovery Center Affiliation: University of Pennsylvania Network: Molecular Library Screening Center Netw...
In DepthDetails PCBioAssay