BDBM41340 9-[3-(4-bromanyl-3,5-dimethyl-pyrazol-1-yl)-2-oxidanyl-propyl]-2-methyl-3,4-dihydropyrido[3,4-b]indol-1-one::9-[3-(4-bromo-3,5-dimethyl-1-pyrazolyl)-2-hydroxypropyl]-2-methyl-3,4-dihydropyrido[3,4-b]indol-1-one::9-[3-(4-bromo-3,5-dimethyl-1H-pyrazol-1-yl)-2-hydroxypropyl]-2-methyl-2,3,4,9-tetrahydro-1H-beta-carbolin-1-one::9-[3-(4-bromo-3,5-dimethyl-pyrazol-1-yl)-2-hydroxy-propyl]-2-methyl-3,4-dihydro-beta-carbolin-1-one::9-[3-(4-bromo-3,5-dimethylpyrazol-1-yl)-2-hydroxypropyl]-2-methyl-3,4-dihydropyrido[3,4-b]indol-1-one::MLS000088210::SMR000072451::cid_2938425
SMILES CN1CCc2c(C1=O)n(CC(O)Cn1nc(C)c(Br)c1C)c1ccccc21
InChI Key InChIKey=OUTRNROAVINECG-UHFFFAOYSA-N
Data  1 IC50
  Tab Delimited (TSV)   2D SDfile   Computed 3D by Vconf -m prep SDfile
Find this compound or compounds like it in BindingDB:
Activity Spreadsheet -- Enzyme Inhibition Constant Data from BindingDB
Found 1 hit for monomerid = 41340
TargetCathepsin S(Homo sapiens (Human))
Pcmd
Curated by PubChem BioAssay
LigandPNGBDBM41340(9-[3-(4-bromanyl-3,5-dimethyl-pyrazol-1-yl)-2-oxid...)
Affinity DataIC50: >5.00E+4nM. Assay description: Screening Center: Penn Center for Molecular Discovery Center Affiliation: University of Pennsylvania Network: Molecular Library Screening Center Netw...
In DepthDetails PCBioAssay