BDBM41342 2-(2-methyl-4-thiazolo[5,4-b]indolyl)acetic acid methyl ester::2-(2-methylthiazol[5,4-b]indol-4-yl)acetic acid methyl ester::MLS000064584::SMR000077200::cid_953929::methyl (2-methyl-4H-[1,3]thiazolo[5,4-b]indol-4-yl)acetate::methyl 2-(2-methyl-[1,3]thiazolo[5,4-b]indol-4-yl)acetate::methyl 2-(2-methyl-[1,3]thiazolo[5,4-b]indol-4-yl)ethanoate
SMILES COC(=O)Cn1c2ccccc2c2nc(C)sc12
InChI Key InChIKey=KXUDHKIQZOTUBV-UHFFFAOYSA-N
Data  1 IC50
  Tab Delimited (TSV)   2D SDfile   Computed 3D by Vconf -m prep SDfile
Find this compound or compounds like it in BindingDB:
Activity Spreadsheet -- Enzyme Inhibition Constant Data from BindingDB
Found 1 hit for monomerid = 41342
TargetCathepsin S(Homo sapiens (Human))
Pcmd
Curated by PubChem BioAssay
LigandPNGBDBM41342(2-(2-methyl-4-thiazolo[5,4-b]indolyl)acetic acid m...)
Affinity DataIC50: >5.00E+4nM. Assay description: Screening Center: Penn Center for Molecular Discovery Center Affiliation: University of Pennsylvania Network: Molecular Library Screening Center Netw...
In DepthDetails PCBioAssay