BDBM41344 MLS000099803::N-(2-bromobenzyl)-2-furamide::N-[(2-bromophenyl)methyl]-2-furancarboxamide::N-[(2-bromophenyl)methyl]furan-2-carboxamide::SMR000080784::cid_1247476
SMILES Brc1ccccc1CNC(=O)c1ccco1
InChI Key InChIKey=GWXFQLPAXKCNQA-UHFFFAOYSA-N
Data  2 IC50
  Tab Delimited (TSV)   2D SDfile   Computed 3D by Vconf -m prep SDfile
Find this compound or compounds like it in BindingDB:
Activity Spreadsheet -- Enzyme Inhibition Constant Data from BindingDB
Found 2 hits for monomerid = 41344
TargetProcathepsin L(Homo sapiens (Human))
Pcmd
Curated by PubChem BioAssay
LigandPNGBDBM41344(MLS000099803 | N-(2-bromobenzyl)-2-furamide | N-[(...)
Affinity DataIC50: >5.00E+4nM. Assay description: Screening Center: Penn Center for Molecular Discovery Center Affiliation: University of Pennsylvania Network: Molecular Library Screening Center Netw...
In DepthDetails PCBioAssay
TargetCathepsin S(Homo sapiens (Human))
Pcmd
Curated by PubChem BioAssay
LigandPNGBDBM41344(MLS000099803 | N-(2-bromobenzyl)-2-furamide | N-[(...)
Affinity DataIC50: >5.00E+4nM. Assay description: Screening Center: Penn Center for Molecular Discovery Center Affiliation: University of Pennsylvania Network: Molecular Library Screening Center Netw...
In DepthDetails PCBioAssay