BDBM41377 2-(cyclohexen-1-yl)ethyl-(7H-purin-6-yl)amine::MLS000101217::N-[2-(1-cyclohexenyl)ethyl]-7H-purin-6-amine::N-[2-(cyclohexen-1-yl)ethyl]-7H-purin-6-amine::SMR000015970::cid_756676
SMILES C(CC1=CCCCC1)Nc1ncnc2nc[nH]c12
InChI Key InChIKey=OVGHJPRBXUWKNN-UHFFFAOYSA-N
Data  2 IC50
  Tab Delimited (TSV)   2D SDfile   Computed 3D by Vconf -m prep SDfile
Find this compound or compounds like it in BindingDB:
Activity Spreadsheet -- Enzyme Inhibition Constant Data from BindingDB
Found 2 hits for monomerid = 41377
TargetProcathepsin L(Homo sapiens (Human))
Pcmd
Curated by PubChem BioAssay
LigandPNGBDBM41377(2-(cyclohexen-1-yl)ethyl-(7H-purin-6-yl)amine | ML...)
Affinity DataIC50: >5.00E+4nM. Assay description: Screening Center: Penn Center for Molecular Discovery Center Affiliation: University of Pennsylvania Network: Molecular Library Screening Center Netw...
In DepthDetails PCBioAssay
TargetCathepsin S(Homo sapiens (Human))
Pcmd
Curated by PubChem BioAssay
LigandPNGBDBM41377(2-(cyclohexen-1-yl)ethyl-(7H-purin-6-yl)amine | ML...)
Affinity DataIC50: >5.00E+4nM. Assay description: Screening Center: Penn Center for Molecular Discovery Center Affiliation: University of Pennsylvania Network: Molecular Library Screening Center Netw...
In DepthDetails PCBioAssay