BDBM41432 MLS000077330::N-(1,3-benzothiazol-2-yl)-2-[(5,5-dimethyl-6H-[1,2,4]triazol[3,4-a]isoquinolin-3-yl)thio]acetamide::N-(1,3-benzothiazol-2-yl)-2-[(5,5-dimethyl-6H-[1,2,4]triazolo[3,4-a]isoquinolin-3-yl)sulfanyl]acetamide::N-(1,3-benzothiazol-2-yl)-2-[(5,5-dimethyl-6H-[1,2,4]triazolo[3,4-a]isoquinolin-3-yl)sulfanyl]ethanamide::N-(1,3-benzothiazol-2-yl)-2-[(5,5-dimethyl-6H-[1,2,4]triazolo[3,4-a]isoquinolin-3-yl)thio]acetamide::N-Benzothiazol-2-yl-2-(5,5-dimethyl-5,6-dihydro-[1,2,4]triazolo[3,4-a]isoquinolin-3-ylsulfanyl)-acetamide::SMR000002036::cid_650241
SMILES CC1(C)Cc2ccccc2-c2nnc(SCC(=O)Nc3nc4ccccc4s3)n12
InChI Key InChIKey=DHRGRPNBXWXVTD-UHFFFAOYSA-N
Data  1 IC50
  Tab Delimited (TSV)   2D SDfile   Computed 3D by Vconf -m prep SDfile
Find this compound or compounds like it in BindingDB:
Activity Spreadsheet -- Enzyme Inhibition Constant Data from BindingDB
Found 1 hit for monomerid = 41432
TargetEphrin type-B receptor 4(Homo sapiens (Human))
The Scripps Research Institute Molecular Screening Center
Curated by PubChem BioAssay
LigandPNGBDBM41432(MLS000077330 | N-(1,3-benzothiazol-2-yl)-2-[(5,5-d...)
Affinity DataIC50: >7.94E+4nM. Assay description: Source (MLSCN Center Name): The Scripps Research Institute Molecular Screening Center Center Affiliation: The Scripps Research Institute, TSRI Assay ...
In DepthDetails PCBioAssay