BDBM41436 2-(4-Benzyl-5-pyridin-2-yl-4H-[1,2,4]triazol-3-ylsulfanyl)-N-cyclopentyl-acetamide::2-[(4-benzyl-5-pyridin-2-yl-1,2,4-triazol-3-yl)sulfanyl]-N-cyclopentylacetamide::2-[[4-benzyl-5-(2-pyridyl)-1,2,4-triazol-3-yl]thio]-N-cyclopentyl-acetamide::MLS000033246::N-cyclopentyl-2-[[4-(phenylmethyl)-5-(2-pyridinyl)-1,2,4-triazol-3-yl]thio]acetamide::N-cyclopentyl-2-[[4-(phenylmethyl)-5-pyridin-2-yl-1,2,4-triazol-3-yl]sulfanyl]ethanamide::SMR000005866::cid_653595
SMILES O=C(CSc1nnc(-c2ccccn2)n1Cc1ccccc1)NC1CCCC1
InChI Key InChIKey=KILFEDYYJGNEJF-UHFFFAOYSA-N
Data  1 IC50
  Tab Delimited (TSV)   2D SDfile   Computed 3D by Vconf -m prep SDfile
Find this compound or compounds like it in BindingDB:
Activity Spreadsheet -- Enzyme Inhibition Constant Data from BindingDB
Found 1 hit for monomerid = 41436
TargetEphrin type-B receptor 4(Homo sapiens (Human))
The Scripps Research Institute Molecular Screening Center
Curated by PubChem BioAssay
LigandPNGBDBM41436(2-(4-Benzyl-5-pyridin-2-yl-4H-[1,2,4]triazol-3-yls...)
Affinity DataIC50: >7.94E+4nM. Assay description: Source (MLSCN Center Name): The Scripps Research Institute Molecular Screening Center Center Affiliation: The Scripps Research Institute, TSRI Assay ...
In DepthDetails PCBioAssay