BDBM41437 MLS000077370::N-Cyclopentylcarbamoylmethyl-2-(5-phenoxymethyl-[1,3,4]oxadiazol-2-ylsulfanyl)-N-thiophen-2-ylmethyl-acetamide::N-cyclopentyl-2-[2-[[5-(phenoxymethyl)-1,3,4-oxadiazol-2-yl]sulfanyl]ethanoyl-(thiophen-2-ylmethyl)amino]ethanamide::N-cyclopentyl-2-[[1-oxo-2-[[5-(phenoxymethyl)-1,3,4-oxadiazol-2-yl]thio]ethyl]-(thiophen-2-ylmethyl)amino]acetamide::N-cyclopentyl-2-[[2-[[5-(phenoxymethyl)-1,3,4-oxadiazol-2-yl]sulfanyl]acetyl]-(thiophen-2-ylmethyl)amino]acetamide::N-cyclopentyl-2-[[2-[[5-(phenoxymethyl)-1,3,4-oxadiazol-2-yl]thio]acetyl]-(2-thenyl)amino]acetamide::SMR000003041::cid_654863
SMILES O=C(CN(Cc1cccs1)C(=O)CSc1nnc(COc2ccccc2)o1)NC1CCCC1
InChI Key InChIKey=UBMYGEGLDITEMZ-UHFFFAOYSA-N
Data  1 IC50
  Tab Delimited (TSV)   2D SDfile   Computed 3D by Vconf -m prep SDfile
Find this compound or compounds like it in BindingDB:
Activity Spreadsheet -- Enzyme Inhibition Constant Data from BindingDB
Found 1 hit for monomerid = 41437
TargetEphrin type-B receptor 4(Homo sapiens (Human))
The Scripps Research Institute Molecular Screening Center
Curated by PubChem BioAssay
LigandPNGBDBM41437(MLS000077370 | N-Cyclopentylcarbamoylmethyl-2-(5-p...)
Affinity DataIC50: >7.94E+4nM. Assay description: Source (MLSCN Center Name): The Scripps Research Institute Molecular Screening Center Center Affiliation: The Scripps Research Institute, TSRI Assay ...
In DepthDetails PCBioAssay