BDBM41451 MLS000053466::N-[1-(1H-benzimidazol-2-yl)-2-phenyl-ethyl]-1-(2,3-dihydro-1,4-benzodioxin-6-yl)-5-keto-pyrrolidine-3-carboxamide::N-[1-(1H-benzimidazol-2-yl)-2-phenyl-ethyl]-1-(2,3-dihydro-1,4-benzodioxin-6-yl)-5-oxidanylidene-pyrrolidine-3-carboxamide::N-[1-(1H-benzimidazol-2-yl)-2-phenylethyl]-1-(2,3-dihydro-1,4-benzodioxin-6-yl)-5-oxo-3-pyrrolidinecarboxamide::N-[1-(1H-benzimidazol-2-yl)-2-phenylethyl]-1-(2,3-dihydro-1,4-benzodioxin-6-yl)-5-oxopyrrolidine-3-carboxamide::SMR000063574::cid_2999928
SMILES O=C(NC(Cc1ccccc1)c1nc2ccccc2[nH]1)C1CN(C(=O)C1)c1ccc2OCCOc2c1
InChI Key InChIKey=DRKIPNUDTIIJLM-UHFFFAOYSA-N
Data  4 IC50
  Tab Delimited (TSV)   2D SDfile   Computed 3D by Vconf -m prep SDfile
Find this compound or compounds like it in BindingDB:
Activity Spreadsheet -- Enzyme Inhibition Constant Data from BindingDB
Found 4 hits for monomerid = 41451
TargetEphrin type-B receptor 4(Homo sapiens (Human))
The Scripps Research Institute Molecular Screening Center
Curated by PubChem BioAssay
LigandPNGBDBM41451(MLS000053466 | N-[1-(1H-benzimidazol-2-yl)-2-pheny...)
Affinity DataIC50: >7.94E+4nM. Assay description: Source (MLSCN Center Name): The Scripps Research Institute Molecular Screening Center Center Affiliation: The Scripps Research Institute, TSRI Assay ...
In DepthDetails PCBioAssay
TargetCarboxy-terminal domain RNA polymerase II polypeptide A small phosphatase 1(Homo sapiens (Human))
Burnham Center For Chemical Genomics
Curated by PubChem BioAssay
LigandPNGBDBM41451(MLS000053466 | N-[1-(1H-benzimidazol-2-yl)-2-pheny...)
Affinity DataIC50:  4.14E+4nM. Assay description: Data Source: Sanford-Burnham Center for Chemical Genomics (SBCCG) Source Affiliation: Sanford-Burnham Medical Research Institute (SBMRI, San Diego, C...
In DepthDetails PCBioAssay
TargetEukaryotic translation initiation factor 4H(Homo sapiens (Human))
Burnham Center For Chemical Genomics
Curated by PubChem BioAssay
LigandPNGBDBM41451(MLS000053466 | N-[1-(1H-benzimidazol-2-yl)-2-pheny...)
Affinity DataIC50:  5.62E+4nM. Assay description: Data Source: Sanford-Burnham Center for Chemical Genomics (SBCCG) Source Affiliation: Sanford-Burnham Medical Research Institute (SBMRI, San Diego, C...
In DepthDetails PCBioAssay
TargetPolyadenylate-binding protein 1(Homo sapiens (Human))
Burnham Center For Chemical Genomics
Curated by PubChem BioAssay
LigandPNGBDBM41451(MLS000053466 | N-[1-(1H-benzimidazol-2-yl)-2-pheny...)
Affinity DataIC50:  8.72E+3nM. Assay description: Data Source: Sanford-Burnham Center for Chemical Genomics (SBCCG) Source Affiliation: Sanford-Burnham Medical Research Institute (SBMRI, San Diego, C...
In DepthDetails PCBioAssay