BDBM41452 1-[2,5-dimethyl-1-(2-oxolanylmethyl)-3-pyrrolyl]-2-[[5-(2-fluoroanilino)-1,3,4-thiadiazol-2-yl]thio]ethanone::1-[2,5-dimethyl-1-(oxolan-2-ylmethyl)pyrrol-3-yl]-2-[[5-(2-fluoroanilino)-1,3,4-thiadiazol-2-yl]sulfanyl]ethanone::1-[2,5-dimethyl-1-(oxolan-2-ylmethyl)pyrrol-3-yl]-2-[[5-[(2-fluorophenyl)amino]-1,3,4-thiadiazol-2-yl]sulfanyl]ethanone::1-[2,5-dimethyl-1-(tetrahydrofurfuryl)pyrrol-3-yl]-2-[[5-(2-fluoroanilino)-1,3,4-thiadiazol-2-yl]thio]ethanone::MLS000058014::SMR000063058::cid_2999986
SMILES Cc1cc(C(=O)CSc2nnc(Nc3ccccc3F)s2)c(C)n1CC1CCCO1
InChI Key InChIKey=DYLXBHOFEFCYKH-UHFFFAOYSA-N
Data  1 IC50
  Tab Delimited (TSV)   2D SDfile   Computed 3D by Vconf -m prep SDfile
Find this compound or compounds like it in BindingDB:
Activity Spreadsheet -- Enzyme Inhibition Constant Data from BindingDB
Found 1 hit for monomerid = 41452
TargetEphrin type-B receptor 4(Homo sapiens (Human))
The Scripps Research Institute Molecular Screening Center
Curated by PubChem BioAssay
LigandPNGBDBM41452(1-[2,5-dimethyl-1-(2-oxolanylmethyl)-3-pyrrolyl]-2...)
Affinity DataIC50: >7.94E+4nM. Assay description: Source (MLSCN Center Name): The Scripps Research Institute Molecular Screening Center Center Affiliation: The Scripps Research Institute, TSRI Assay ...
In DepthDetails PCBioAssay