BDBM41456 4-(1,4-dioxa-8-azaspiro[4.5]dec-8-ylcarbonyl)-3,8-dimethyl-1-oxaspiro[4.5]dec-3-en-2-one::4-(1,4-dioxa-8-azaspiro[4.5]decan-8-ylcarbonyl)-3,8-dimethyl-1-oxaspiro[4.5]dec-3-en-2-one::4-(1,4-dioxa-8-azaspiro[4.5]decane-8-carbonyl)-3,8-dimethyl-1-oxaspiro[4.5]dec-3-en-2-one::4-[1,4-dioxa-8-azaspiro[4.5]decan-8-yl(oxo)methyl]-3,8-dimethyl-1-oxaspiro[4.5]dec-3-en-2-one::MLS000089427::SMR000027802::cid_3240838
SMILES CC1CCC2(CC1)OC(=O)C(C)=C2C(=O)N1CCC2(CC1)OCCO2
InChI Key InChIKey=BOPKXSOLEFLUEU-UHFFFAOYSA-N
Data  1 IC50
  Tab Delimited (TSV)   2D SDfile   Computed 3D by Vconf -m prep SDfile
Find this compound or compounds like it in BindingDB:
Activity Spreadsheet -- Enzyme Inhibition Constant Data from BindingDB
Found 1 hit for monomerid = 41456
TargetEphrin type-B receptor 4(Homo sapiens (Human))
The Scripps Research Institute Molecular Screening Center
Curated by PubChem BioAssay
LigandPNGBDBM41456(4-(1,4-dioxa-8-azaspiro[4.5]dec-8-ylcarbonyl)-3,8-...)
Affinity DataIC50: >7.94E+4nM. Assay description: Source (MLSCN Center Name): The Scripps Research Institute Molecular Screening Center Center Affiliation: The Scripps Research Institute, TSRI Assay ...
Ligand InfoPC cidPC sid
In DepthDetails PCBioAssay