BDBM41462 3-[5-[(4-fluorobenzyl)thio]-3-keto-2H-imidazo[1,2-c]quinazolin-2-yl]-N-(2-furfuryl)propionamide::3-[5-[(4-fluorophenyl)methylsulfanyl]-3-oxidanylidene-2H-imidazo[1,2-c]quinazolin-2-yl]-N-(furan-2-ylmethyl)propanamide::3-[5-[(4-fluorophenyl)methylsulfanyl]-3-oxo-2H-imidazo[1,2-c]quinazolin-2-yl]-N-(furan-2-ylmethyl)propanamide::3-[5-[(4-fluorophenyl)methylthio]-3-oxo-2H-imidazo[1,2-c]quinazolin-2-yl]-N-(2-furanylmethyl)propanamide::3-{5-[(4-fluorobenzyl)thio]-3-oxo-2,3-dihydroimidazo[1,2-c]quinazolin-2-yl}-N-(2-furylmethyl)propanamide::MLS000094879::SMR000030432::cid_3245810
SMILES Fc1ccc(CSC2=Nc3ccccc3C3=NC(CCC(=O)NCc4ccco4)C(=O)N23)cc1
InChI Key InChIKey=LKENQCHADBQIHZ-UHFFFAOYSA-N
Data  1 IC50
  Tab Delimited (TSV)   2D SDfile   Computed 3D by Vconf -m prep SDfile
Find this compound or compounds like it in BindingDB:
Activity Spreadsheet -- Enzyme Inhibition Constant Data from BindingDB
Found 1 hit for monomerid = 41462
TargetEphrin type-B receptor 4(Homo sapiens (Human))
The Scripps Research Institute Molecular Screening Center
Curated by PubChem BioAssay
LigandPNGBDBM41462(3-[5-[(4-fluorobenzyl)thio]-3-keto-2H-imidazo[1,2-...)
Affinity DataIC50: >7.94E+4nM. Assay description: Source (MLSCN Center Name): The Scripps Research Institute Molecular Screening Center Center Affiliation: The Scripps Research Institute, TSRI Assay ...
In DepthDetails PCBioAssay