BDBM41470 2-(3-furanyl)-3-(2-phenylethyl)-4-quinazolinone::2-(3-furyl)-3-(2-phenylethyl)-4(3H)-quinazolinone::2-(3-furyl)-3-phenethyl-quinazolin-4-one::2-(furan-3-yl)-3-(2-phenylethyl)quinazolin-4-one::MLS000066023::SMR000079471::cid_1248344
SMILES O=c1n(CCc2ccccc2)c(nc2ccccc12)-c1ccoc1
InChI Key InChIKey=VWDIXGPHJUFQHH-UHFFFAOYSA-N
Data  3 IC50
  Tab Delimited (TSV)   2D SDfile   Computed 3D by Vconf -m prep SDfile
Find this compound or compounds like it in BindingDB:
Activity Spreadsheet -- Enzyme Inhibition Constant Data from BindingDB
Found 3 hits for monomerid = 41470
TargetEphrin type-B receptor 4(Homo sapiens (Human))
The Scripps Research Institute Molecular Screening Center
Curated by PubChem BioAssay
LigandPNGBDBM41470(2-(3-furanyl)-3-(2-phenylethyl)-4-quinazolinone | ...)
Affinity DataIC50: >7.94E+4nM. Assay description: Source (MLSCN Center Name): The Scripps Research Institute Molecular Screening Center Center Affiliation: The Scripps Research Institute, TSRI Assay ...
In DepthDetails PCBioAssay
TargetPhospholipase A2(Homo sapiens (Human))
Burnham Center For Chemical Genomics
Curated by PubChem BioAssay
LigandPNGBDBM41470(2-(3-furanyl)-3-(2-phenylethyl)-4-quinazolinone | ...)
Affinity DataIC50:  1.39E+4nM. Assay description: Data Source: Sanford-Burnham Center for Chemical Genomics (SBCCG) Source Affiliation: Sanford-Burnham Medical Research Institute (SBMRI, San Diego, C...
In DepthDetails PCBioAssay
TargetCysteine protease ATG4B(Homo sapiens (Human))
Burnham Center For Chemical Genomics
Curated by PubChem BioAssay
LigandPNGBDBM41470(2-(3-furanyl)-3-(2-phenylethyl)-4-quinazolinone | ...)
Affinity DataIC50:  1.43E+4nM. Assay description: Data Source: Sanford-Burnham Center for Chemical Genomics (SBCCG) Source Affiliation: Sanford-Burnham Medical Research Institute (SBMRI, San Diego, C...
In DepthDetails PCBioAssay