BDBM41475 2-(4-fluoroanilino)-N-(5-propyl-1,3,4-thiadiazol-2-yl)acetamide::2-[(4-fluorophenyl)amino]-N-(5-propyl-1,3,4-thiadiazol-2-yl)ethanamide::MLS000108420::SMR000104377::cid_1361150
SMILES CCCc1nnc(NC(=O)CNc2ccc(F)cc2)s1
InChI Key InChIKey=WUVLYGVFHQIPIF-UHFFFAOYSA-N
Data  1 IC50
  Tab Delimited (TSV)   2D SDfile   Computed 3D by Vconf -m prep SDfile
Find this compound or compounds like it in BindingDB:
Activity Spreadsheet -- Enzyme Inhibition Constant Data from BindingDB
Found 1 hit for monomerid = 41475
TargetEphrin type-B receptor 4(Homo sapiens (Human))
The Scripps Research Institute Molecular Screening Center
Curated by PubChem BioAssay
LigandPNGBDBM41475(2-(4-fluoroanilino)-N-(5-propyl-1,3,4-thiadiazol-2...)
Affinity DataIC50: >7.94E+4nM. Assay description: Source (MLSCN Center Name): The Scripps Research Institute Molecular Screening Center Center Affiliation: The Scripps Research Institute, TSRI Assay ...
In DepthDetails PCBioAssay