BDBM41514 2-(4-keto-5,6-dimethyl-thieno[2,3-d]pyrimidin-3-yl)propionic acid propyl ester::2-(5,6-Dimethyl-4-oxo-4H-thieno[2,3-d]pyrimidin-3-yl)-propionic acid propyl ester::2-(5,6-dimethyl-4-oxo-3-thieno[2,3-d]pyrimidinyl)propanoic acid propyl ester::MLS000528913::SMR000121388::cid_2791262::propyl 2-(5,6-dimethyl-4-oxidanylidene-thieno[2,3-d]pyrimidin-3-yl)propanoate::propyl 2-(5,6-dimethyl-4-oxothieno[2,3-d]pyrimidin-3-yl)propanoate
SMILES CCCOC(=O)C(C)n1cnc2sc(C)c(C)c2c1=O
InChI Key InChIKey=JTQSEZVERMWLDZ-UHFFFAOYSA-N
Data  1 IC50
  Tab Delimited (TSV)   2D SDfile   Computed 3D by Vconf -m prep SDfile
Find this compound or compounds like it in BindingDB:
Activity Spreadsheet -- Enzyme Inhibition Constant Data from BindingDB
Found 1 hit for monomerid = 41514
TargetEphrin type-B receptor 4(Homo sapiens (Human))
The Scripps Research Institute Molecular Screening Center
Curated by PubChem BioAssay
LigandPNGBDBM41514(2-(4-keto-5,6-dimethyl-thieno[2,3-d]pyrimidin-3-yl...)
Affinity DataIC50: >7.94E+4nM. Assay description: Source (MLSCN Center Name): The Scripps Research Institute Molecular Screening Center Center Affiliation: The Scripps Research Institute, TSRI Assay ...
In DepthDetails PCBioAssay