BDBM41516 4-chloranyl-6-(4-fluorophenyl)sulfanyl-3-phenyl-pyridazine::4-chloro-6-(4-fluorophenyl)sulfanyl-3-phenylpyridazine::4-chloro-6-[(4-fluorophenyl)sulfanyl]-3-phenylpyridazine::4-chloro-6-[(4-fluorophenyl)thio]-3-phenyl-pyridazine::4-chloro-6-[(4-fluorophenyl)thio]-3-phenylpyridazine::MLS000327135::SMR000179689::cid_6404754
SMILES Fc1ccc(Sc2cc(Cl)c(nn2)-c2ccccc2)cc1
InChI Key InChIKey=NUBKPQCVDFSERI-UHFFFAOYSA-N
Data  1 IC50
  Tab Delimited (TSV)   2D SDfile   Computed 3D by Vconf -m prep SDfile
Find this compound or compounds like it in BindingDB:
Activity Spreadsheet -- Enzyme Inhibition Constant Data from BindingDB
Found 1 hit for monomerid = 41516
TargetEphrin type-B receptor 4(Homo sapiens (Human))
The Scripps Research Institute Molecular Screening Center
Curated by PubChem BioAssay
LigandPNGBDBM41516(4-chloranyl-6-(4-fluorophenyl)sulfanyl-3-phenyl-py...)
Affinity DataIC50: >7.94E+4nM. Assay description: Source (MLSCN Center Name): The Scripps Research Institute Molecular Screening Center Center Affiliation: The Scripps Research Institute, TSRI Assay ...
In DepthDetails PCBioAssay