BDBM41519 7-methyl-2-phenyl-5-(4-pyridin-2-ylpiperazin-1-yl)imidazo[1,2-a]pyrimidine::7-methyl-2-phenyl-5-[4-(2-pyridinyl)-1-piperazinyl]imidazo[1,2-a]pyrimidine::7-methyl-2-phenyl-5-[4-(2-pyridinyl)piperazino]imidazo[1,2-a]pyrimidine::7-methyl-2-phenyl-5-[4-(2-pyridyl)piperazino]imidazo[1,2-a]pyrimidine::MLS000546878::SMR000180076::cid_1472741
SMILES Cc1cc(N2CCN(CC2)c2ccccn2)n2cc(nc2n1)-c1ccccc1
InChI Key InChIKey=PJFDTGIRHFVUPN-UHFFFAOYSA-N
Data  1 IC50
  Tab Delimited (TSV)   2D SDfile   Computed 3D by Vconf -m prep SDfile
Find this compound or compounds like it in BindingDB:
Activity Spreadsheet -- Enzyme Inhibition Constant Data from BindingDB
Found 1 hit for monomerid = 41519
TargetEphrin type-B receptor 4(Homo sapiens (Human))
The Scripps Research Institute Molecular Screening Center
Curated by PubChem BioAssay
LigandPNGBDBM41519(7-methyl-2-phenyl-5-(4-pyridin-2-ylpiperazin-1-yl)...)
Affinity DataIC50: >7.94E+4nM. Assay description: Source (MLSCN Center Name): The Scripps Research Institute Molecular Screening Center Center Affiliation: The Scripps Research Institute, TSRI Assay ...
In DepthDetails PCBioAssay