BDBM41520 3-chlorobenzenecarbaldehyde N-(4-quinazolinyl)hydrazone::MLS000543408::N-[(3-chlorophenyl)methylideneamino]-4-quinazolinamine::N-[(3-chlorophenyl)methylideneamino]quinazolin-4-amine::SMR000169377::[(3-chlorobenzylidene)amino]-quinazolin-4-yl-amine::cid_3776711
SMILES Clc1cccc(CN=Nc2ncnc3ccccc23)c1
InChI Key InChIKey=HJXZYYOAQTZRRG-UHFFFAOYSA-N
Data  1 IC50
  Tab Delimited (TSV)   2D SDfile   Computed 3D by Vconf -m prep SDfile
Find this compound or compounds like it in BindingDB:
Activity Spreadsheet -- Enzyme Inhibition Constant Data from BindingDB
Found 1 hit for monomerid = 41520
TargetEphrin type-B receptor 4(Homo sapiens (Human))
The Scripps Research Institute Molecular Screening Center
Curated by PubChem BioAssay
LigandPNGBDBM41520(3-chlorobenzenecarbaldehyde N-(4-quinazolinyl)hydr...)
Affinity DataIC50: >7.94E+4nM. Assay description: Source (MLSCN Center Name): The Scripps Research Institute Molecular Screening Center Center Affiliation: The Scripps Research Institute, TSRI Assay ...
In DepthDetails PCBioAssay