BDBM415554 (2R,3R,4S,5R)-2-(4-amino-7H-pyrrolo[2,3-d]pyrimidin-7-yl)-5-((R)-(3,4-difluorophenyl)(hydroxy)methyl)tetrahydrofuran-3,4-diol (MM-7)::US10428104, Example 85
SMILES Nc1ncnc2n(ccc12)[C@@H]1O[C@H]([C@H](O)c2ccc(F)c(F)c2)[C@@H](O)[C@H]1O
InChI Key InChIKey=YDGIDMHKHFFVPX-QFRSUPTLSA-N
Data  2 IC50
  Tab Delimited (TSV)   2D SDfile   Computed 3D by Vconf -m prep SDfile
Find this compound or compounds like it in BindingDB:
Activity Spreadsheet -- Enzyme Inhibition Constant Data from BindingDB
Found 2 hits for monomerid = 415554
TargetMethylosome protein 50/Protein arginine N-methyltransferase 5(Homo sapiens (Human))
Prelude Therapeutics
Curated by ChEMBL
LigandPNGBDBM415554((2R,3R,4S,5R)-2-(4-amino-7H-pyrrolo[2,3-d]pyrimidi...)
Affinity DataIC50:  1nM. Assay description: Inhibition of full length N-terminal FLAG-tagged PRMT5 (unknown origin)/MEP50 (unknown origin) expressed in baculovirus infected Sf21 insect cells us...
Ligand InfoPC cidPC sid
In DepthDetails ArticlePubMed
TargetProtein arginine N-methyltransferase 5(Homo sapiens (Human))
Pfizer
US Patent
LigandPNGBDBM415554((2R,3R,4S,5R)-2-(4-amino-7H-pyrrolo[2,3-d]pyrimidi...)
Affinity DataIC50:  1nM. Assay description: Compounds were solubilized in DMSO and serially diluted, using 3-fold dilutions, into 100% DMSO at a concentration 50-fold greater than the desired a...
Ligand InfoPC cidPC sid
In DepthDetails US Patent