BDBM416516 7-bromo-N-(4-(ethylsulfonyl)benzyl)-1-methyl-2-(4-(trifluoromethyl)benzyl)-1H-benzo[d]imidazole-5-carboxamide::US10301261, Compound BE-59::US10829448, Compound BE-59
SMILES CCS(=O)(=O)c1ccc(CNC(=O)c2cc(Br)c3n(C)c(Cc4ccc(cc4)C(F)(F)F)nc3c2)cc1
InChI Key InChIKey=MRDIDIXVDBGUJB-UHFFFAOYSA-N
Data  2 KI
  Tab Delimited (TSV)   2D SDfile   Computed 3D by Vconf -m prep SDfile
Find this compound or compounds like it in BindingDB:
Activity Spreadsheet -- Enzyme Inhibition Constant Data from BindingDB
Found 2 hits for monomerid = 416516
TargetNuclear receptor ROR-gamma(Homo sapiens (Human))
Vitae Pharmaceuticals
US Patent
LigandPNGBDBM416516(7-bromo-N-(4-(ethylsulfonyl)benzyl)-1-methyl-2-(4-...)
Affinity DataKi:  550nM. Assay description: Compounds described herein were tested for ability to bind to RORγ in a cell-free competition assay with commercially available radio-ligand (RL...
Ligand InfoPC cidPC sid
In DepthDetails US Patent
TargetNuclear receptor ROR-gamma(Homo sapiens (Human))
Vitae Pharmaceuticals
US Patent
LigandPNGBDBM416516(7-bromo-N-(4-(ethylsulfonyl)benzyl)-1-methyl-2-(4-...)
Affinity DataKi:  550nM. Assay description: Compounds described herein were tested for ability to bind to RORγ in a cell-free competition assay with commercially available radio-ligand (RL...
Ligand InfoPC cidPC sid
In DepthDetails US Patent