BDBM41720 1-[2,5-dimethyl-1-(phenylmethyl)pyrrol-3-yl]-2-(3-ethanoylphenoxy)ethanone::2-(3-acetylphenoxy)-1-(1-benzyl-2,5-dimethyl-pyrrol-3-yl)ethanone::2-(3-acetylphenoxy)-1-(1-benzyl-2,5-dimethylpyrrol-3-yl)ethanone::2-(3-acetylphenoxy)-1-[2,5-dimethyl-1-(phenylmethyl)-3-pyrrolyl]ethanone::SR-01000759119-1::cid_8172457
SMILES CC(=O)c1cccc(OCC(=O)c2cc(C)n(Cc3ccccc3)c2C)c1
InChI Key InChIKey=JBSGMCJWQZJIGW-UHFFFAOYSA-N
Data  2 EC50
  Tab Delimited (TSV)   2D SDfile   Computed 3D by Vconf -m prep SDfile
Find this compound or compounds like it in BindingDB:
Activity Spreadsheet -- Enzyme Inhibition Constant Data from BindingDB
Found 2 hits for monomerid = 41720
TargetSphingosine 1-phosphate receptor 2(Homo sapiens (Human))
The Scripps Research Institute Molecular Screening Center
Curated by PubChem BioAssay
LigandPNGBDBM41720(1-[2,5-dimethyl-1-(phenylmethyl)pyrrol-3-yl]-2-(3-...)
Affinity DataEC50: >4.40E+4nM. Assay description: Source (MLSCN Center Name): The Scripps Research Institute Molecular Screening Center Center Affiliation: The Scripps Research Institute (TSRI) Assay...
In DepthDetails PCBioAssay
TargetSphingosine 1-phosphate receptor 2(Homo sapiens (Human))
The Scripps Research Institute Molecular Screening Center
Curated by PubChem BioAssay
LigandPNGBDBM41720(1-[2,5-dimethyl-1-(phenylmethyl)pyrrol-3-yl]-2-(3-...)
Affinity DataEC50: >3.00E+4nM. Assay description: Source (MLSCN Center Name): The Scripps Research Institute Molecular Screening Center Center Affiliation: The Scripps Research Institute (TSRI) Assay...
In DepthDetails PCBioAssay