BDBM41729 2-[[2-(1-benzyl-2,5-dimethyl-pyrrol-3-yl)-2-keto-ethyl]-methyl-amino]-N-(4-methoxyphenyl)acetamide::2-[[2-(1-benzyl-2,5-dimethylpyrrol-3-yl)-2-oxoethyl]-methylamino]-N-(4-methoxyphenyl)acetamide::2-[[2-[2,5-dimethyl-1-(phenylmethyl)-3-pyrrolyl]-2-oxoethyl]-methylamino]-N-(4-methoxyphenyl)acetamide::2-[[2-[2,5-dimethyl-1-(phenylmethyl)pyrrol-3-yl]-2-oxidanylidene-ethyl]-methyl-amino]-N-(4-methoxyphenyl)ethanamide::SR-01000759102-1::cid_8817003
SMILES COc1ccc(NC(=O)CN(C)CC(=O)c2cc(C)n(Cc3ccccc3)c2C)cc1
InChI Key InChIKey=IIEAJSOCKCWBEP-UHFFFAOYSA-N
Data  2 EC50
  Tab Delimited (TSV)   2D SDfile   Computed 3D by Vconf -m prep SDfile
Find this compound or compounds like it in BindingDB:
Activity Spreadsheet -- Enzyme Inhibition Constant Data from BindingDB
Found 2 hits for monomerid = 41729
TargetSphingosine 1-phosphate receptor 2(Homo sapiens (Human))
The Scripps Research Institute Molecular Screening Center
Curated by PubChem BioAssay
LigandPNGBDBM41729(2-[[2-(1-benzyl-2,5-dimethyl-pyrrol-3-yl)-2-keto-e...)
Affinity DataEC50: >4.40E+4nM. Assay description: Source (MLSCN Center Name): The Scripps Research Institute Molecular Screening Center Center Affiliation: The Scripps Research Institute (TSRI) Assay...
In DepthDetails PCBioAssay
TargetSphingosine 1-phosphate receptor 2(Homo sapiens (Human))
The Scripps Research Institute Molecular Screening Center
Curated by PubChem BioAssay
LigandPNGBDBM41729(2-[[2-(1-benzyl-2,5-dimethyl-pyrrol-3-yl)-2-keto-e...)
Affinity DataEC50: >3.00E+4nM. Assay description: Source (MLSCN Center Name): The Scripps Research Institute Molecular Screening Center Center Affiliation: The Scripps Research Institute (TSRI) Assay...
In DepthDetails PCBioAssay