BDBM417776 US10457672, Compound 15
SMILES O=C(CCC(=O)c1ccc2OCCOc2c1)c1ccncc1
InChI Key InChIKey=OVGOCMHTDAEGSN-UHFFFAOYSA-N
Data  1 EC50
  Tab Delimited (TSV)   2D SDfile   Computed 3D by Vconf -m prep SDfile
Find this compound or compounds like it in BindingDB:
Activity Spreadsheet -- Enzyme Inhibition Constant Data from BindingDB
Found 1 hit for monomerid = 417776
TargetCatenin beta-1/Protein Wnt-3a(Homo sapiens (Human))
Samumed
US Patent
LigandPNGBDBM417776(US10457672, Compound 15)
Affinity DataEC50:  90nM. Assay description: Compounds that enhance the Wnt activity, or Activators, were assayed as follows. Reporter cell lines were generated by stably transducing cells of co...
Ligand InfoPC cidPC sid
In DepthDetails US Patent