BDBM41860 5-(4-fluorophenyl)-1-methyl-3-pyrazolecarboxylic acid::5-(4-fluorophenyl)-1-methyl-pyrazole-3-carboxylic acid::5-(4-fluorophenyl)-1-methylpyrazole-3-carboxylic acid::MLS-0111583.0001::cid_6484191
SMILES Cn1nc(cc1-c1ccc(F)cc1)C(O)=O
InChI Key InChIKey=ODPKQFCBBUCKGS-UHFFFAOYSA-N
Data  2 IC50
  Tab Delimited (TSV)   2D SDfile   Computed 3D by Vconf -m prep SDfile
Find this compound or compounds like it in BindingDB:
Activity Spreadsheet -- Enzyme Inhibition Constant Data from BindingDB
Found 2 hits for monomerid = 41860
TargetAlkaline phosphatase, tissue-nonspecific isozyme(Homo sapiens (Human))
Burnham Center For Chemical Genomics
Curated by PubChem BioAssay
LigandPNGBDBM41860(5-(4-fluorophenyl)-1-methyl-3-pyrazolecarboxylic a...)
Affinity DataIC50: >1.00E+5nM. Assay description: Sanford-Burnham Center for Chemical Genomics (SBCCG) Sanford-Burnham Medical Research Institute (SBMRI, San Diego, CA) NIH Molecular Libraries Screen...
In DepthDetails PCBioAssay
TargetAlkaline phosphatase, germ cell type(Homo sapiens (Human))
Sanford-Burnham Center For Chemical Genomics
Curated by PubChem BioAssay
LigandPNGBDBM41860(5-(4-fluorophenyl)-1-methyl-3-pyrazolecarboxylic a...)
Affinity DataIC50: >1.00E+5nM. Assay description: Data Source: Sanford-Burnham Center for Chemical Genomics (SBCCG) Source Affiliation: Sanford-Burnham Medical Research Institute (SBMRI, San Diego, C...
In DepthDetails PCBioAssay