BDBM41863 3-(4-bromophenyl)-1H-pyrazole-5-carboxylic acid methyl ester::MLS-0056974.0001::cid_3239557::methyl 3-(4-bromophenyl)-1H-pyrazole-5-carboxylate
SMILES COC(=O)c1cc(n[nH]1)-c1ccc(Br)cc1
InChI Key InChIKey=IRKMOAWZRZMSCU-UHFFFAOYSA-N
Data  3 IC50
  Tab Delimited (TSV)   2D SDfile   Computed 3D by Vconf -m prep SDfile
Find this compound or compounds like it in BindingDB:
Activity Spreadsheet -- Enzyme Inhibition Constant Data from BindingDB
Found 3 hits for monomerid = 41863
TargetAlkaline phosphatase, germ cell type(Homo sapiens (Human))
Sanford-Burnham Center For Chemical Genomics
Curated by PubChem BioAssay
LigandPNGBDBM41863(3-(4-bromophenyl)-1H-pyrazole-5-carboxylic acid me...)
Affinity DataIC50: >1.00E+5nM. Assay description: Data Source: Sanford-Burnham Center for Chemical Genomics (SBCCG) Source Affiliation: Sanford-Burnham Medical Research Institute (SBMRI, San Diego, C...
In DepthDetails PCBioAssay
TargetAlkaline phosphatase, tissue-nonspecific isozyme(Homo sapiens (Human))
Burnham Center For Chemical Genomics
Curated by PubChem BioAssay
LigandPNGBDBM41863(3-(4-bromophenyl)-1H-pyrazole-5-carboxylic acid me...)
Affinity DataIC50: >1.00E+5nM. Assay description: Sanford-Burnham Center for Chemical Genomics (SBCCG) Sanford-Burnham Medical Research Institute (SBMRI, San Diego, CA) NIH Molecular Libraries Screen...
In DepthDetails PCBioAssay
TargetAlkaline phosphatase, tissue-nonspecific isozyme(Homo sapiens (Human))
Burnham Center For Chemical Genomics
Curated by PubChem BioAssay
LigandPNGBDBM41863(3-(4-bromophenyl)-1H-pyrazole-5-carboxylic acid me...)
Affinity DataIC50:  1.14E+3nM. Assay description: Sanford-Burnham Center for Chemical Genomics (SBCCG) Sanford-Burnham Medical Research Institute (SBMRI, San Diego, CA) NIH Molecular Libraries Screen...
In DepthDetails PCBioAssay