BDBM41878 4,5-dimethoxy-2-(3-methylsulfanyl-1H-1,2,4-triazol-5-yl)isoindole-1,3-dione::4,5-dimethoxy-2-[3-(methylthio)-1H-1,2,4-triazol-5-yl]isoindole-1,3-dione::4,5-dimethoxy-2-[3-(methylthio)-1H-1,2,4-triazol-5-yl]isoindoline-1,3-quinone::MLS-0146265.0001::cid_16433414
SMILES COc1ccc2C(=O)N(C(=O)c2c1OC)c1nnc(SC)[nH]1
InChI Key InChIKey=OJWLXSBLBHTNCD-UHFFFAOYSA-N
Data  2 IC50
  Tab Delimited (TSV)   2D SDfile   Computed 3D by Vconf -m prep SDfile
Find this compound or compounds like it in BindingDB:
Activity Spreadsheet -- Enzyme Inhibition Constant Data from BindingDB
Found 2 hits for monomerid = 41878
TargetAlkaline phosphatase, tissue-nonspecific isozyme(Homo sapiens (Human))
Burnham Center For Chemical Genomics
Curated by PubChem BioAssay
LigandPNGBDBM41878(4,5-dimethoxy-2-(3-methylsulfanyl-1H-1,2,4-triazol...)
Affinity DataIC50:  3.41E+4nM. Assay description: Sanford-Burnham Center for Chemical Genomics (SBCCG) Sanford-Burnham Medical Research Institute (SBMRI, San Diego, CA) NIH Molecular Libraries Screen...
In DepthDetails PCBioAssay
TargetAlkaline phosphatase, germ cell type(Homo sapiens (Human))
Sanford-Burnham Center For Chemical Genomics
Curated by PubChem BioAssay
LigandPNGBDBM41878(4,5-dimethoxy-2-(3-methylsulfanyl-1H-1,2,4-triazol...)
Affinity DataIC50: >1.00E+5nM. Assay description: Data Source: Sanford-Burnham Center for Chemical Genomics (SBCCG) Source Affiliation: Sanford-Burnham Medical Research Institute (SBMRI, San Diego, C...
In DepthDetails PCBioAssay