BDBM41917 1-Cyclohexyl-3-[8-(4-methoxy-benzenesulfonyl)-8-aza-bicyclo[3.2.1]oct-3-yl]-urea::1-cyclohexyl-3-[8-(4-methoxyphenyl)sulfonyl-8-azabicyclo[3.2.1]octan-3-yl]urea::MLS000124029::SMR000124601::cid_3220699
SMILES [H]C12CCC([H])(CC(C1)NC(=O)NC1CCCCC1)N2S(=O)(=O)c1ccc(OC)cc1
InChI Key InChIKey=MLRTUTVJAAIXTO-UHFFFAOYSA-N
Data  1 IC50
  Tab Delimited (TSV)   2D SDfile   Computed 3D by Vconf -m prep SDfile
Find this compound or compounds like it in BindingDB:
Activity Spreadsheet -- Enzyme Inhibition Constant Data from BindingDB
Found 1 hit for monomerid = 41917
TargetBifunctional epoxide hydrolase 2(Homo sapiens (Human))
Columbia University Molecular Screening Center
Curated by PubChem BioAssay
LigandPNGBDBM41917(1-Cyclohexyl-3-[8-(4-methoxy-benzenesulfonyl)-8-az...)
Affinity DataIC50:  39.4nM. Assay description: Data Source: Columbia University Molecular Screening Center Source (MLSCN Center Name): Columbia University Molecular Screening Center Center Affilia...
Ligand InfoPC cidPC sid
In DepthDetails PCBioAssay