BDBM41930 MLS000324870::N-[2-[2-[(2-chlorophenyl)methylidene]hydrazinyl]-2-oxidanylidene-ethyl]-N-(2-methylphenyl)benzamide::N-[2-[2-[(2-chlorophenyl)methylidene]hydrazinyl]-2-oxoethyl]-N-(2-methylphenyl)benzamide::N-[2-[N'-(2-chlorobenzylidene)hydrazino]-2-keto-ethyl]-N-(o-tolyl)benzamide::N-{2-[2-(2-chlorobenzylidene)hydrazino]-2-oxoethyl}-N-(2-methylphenyl)benzamide::SMR000163117::cid_11948769
SMILES Cc1ccccc1N(CC(=O)NN=Cc1ccccc1Cl)C(=O)c1ccccc1
InChI Key InChIKey=GKPGICMWMJUPHT-UHFFFAOYSA-N
Data  1 IC50
  Tab Delimited (TSV)   2D SDfile   Computed 3D by Vconf -m prep SDfile
Find this compound or compounds like it in BindingDB:
Activity Spreadsheet -- Enzyme Inhibition Constant Data from BindingDB
Found 1 hit for monomerid = 41930
TargetBifunctional epoxide hydrolase 2(Homo sapiens (Human))
Columbia University Molecular Screening Center
Curated by PubChem BioAssay
LigandPNGBDBM41930(MLS000324870 | N-[2-[2-[(2-chlorophenyl)methyliden...)
Affinity DataIC50:  265nM. Assay description: Data Source: Columbia University Molecular Screening Center Source (MLSCN Center Name): Columbia University Molecular Screening Center Center Affilia...
In DepthDetails PCBioAssay