BDBM41933 1-(4-chlorophenyl)-3-(1,2,3,4-tetrahydronaphthalen-1-yl)urea::1-(4-chlorophenyl)-3-tetralin-1-yl-urea::MLS000545773::N-(4-chlorophenyl)-N'-(1,2,3,4-tetrahydro-1-naphthalenyl)urea::SMR000159523::cid_4250169
SMILES Clc1ccc(NC(=O)NC2CCCc3ccccc23)cc1
InChI Key InChIKey=CUILVPGDLGSLFT-UHFFFAOYSA-N
Data  1 IC50
  Tab Delimited (TSV)   2D SDfile   Computed 3D by Vconf -m prep SDfile
Find this compound or compounds like it in BindingDB:
Activity Spreadsheet -- Enzyme Inhibition Constant Data from BindingDB
Found 1 hit for monomerid = 41933
TargetBifunctional epoxide hydrolase 2(Homo sapiens (Human))
Columbia University Molecular Screening Center
Curated by PubChem BioAssay
LigandPNGBDBM41933(1-(4-chlorophenyl)-3-(1,2,3,4-tetrahydronaphthalen...)
Affinity DataIC50:  20.7nM. Assay description: Data Source: Columbia University Molecular Screening Center Source (MLSCN Center Name): Columbia University Molecular Screening Center Center Affilia...
In DepthDetails PCBioAssay