BDBM41938 6-tert-butyl-N'-(2-thienylmethylene)-4,5,6,7-tetrahydro-1-benzothiophene-3-carbohydrazide::6-tert-butyl-N-(2-thenylideneamino)-4,5,6,7-tetrahydrobenzothiophene-3-carboxamide::6-tert-butyl-N-(thiophen-2-ylmethylideneamino)-4,5,6,7-tetrahydro-1-benzothiophene-3-carboxamide::MLS000543682::SMR000160276::cid_3688989
SMILES CC(C)(C)C1CCc2c(C1)scc2C(=O)NN=Cc1cccs1
InChI Key InChIKey=HWRYTDKJTKDHQG-UHFFFAOYSA-N
Data  1 IC50
  Tab Delimited (TSV)   2D SDfile   Computed 3D by Vconf -m prep SDfile
Find this compound or compounds like it in BindingDB:
Activity Spreadsheet -- Enzyme Inhibition Constant Data from BindingDB
Found 1 hit for monomerid = 41938
TargetBifunctional epoxide hydrolase 2(Homo sapiens (Human))
Columbia University Molecular Screening Center
Curated by PubChem BioAssay
LigandPNGBDBM41938(6-tert-butyl-N'-(2-thienylmethylene)-4,5,6,7-t...)
Affinity DataIC50:  15.9nM. Assay description: Data Source: Columbia University Molecular Screening Center Source (MLSCN Center Name): Columbia University Molecular Screening Center Center Affilia...
In DepthDetails PCBioAssay