BDBM41989 6-[(2,4-dimethoxyphenyl)-(4-morpholinyl)methyl]-1,3-benzodioxol-5-ol::6-[(2,4-dimethoxyphenyl)-morpholin-4-yl-methyl]-1,3-benzodioxol-5-ol::6-[(2,4-dimethoxyphenyl)-morpholin-4-ylmethyl]-1,3-benzodioxol-5-ol::6-[(2,4-dimethoxyphenyl)-morpholino-methyl]sesamol::cid_149131
SMILES COc1ccc(C(N2CCOCC2)c2cc3OCOc3cc2O)c(OC)c1
InChI Key InChIKey=NCPFBIXFCFNTIV-UHFFFAOYSA-N
Data  1 IC50
  Tab Delimited (TSV)   2D SDfile   Computed 3D by Vconf -m prep SDfile
Find this compound or compounds like it in BindingDB:
Activity Spreadsheet -- Enzyme Inhibition Constant Data from BindingDB
Found 1 hit for monomerid = 41989
TargetMothers against decapentaplegic homolog 3(Homo sapiens (Human))
Emory University
Curated by PubChem BioAssay
LigandPNGBDBM41989(6-[(2,4-dimethoxyphenyl)-(4-morpholinyl)methyl]-1,...)
Affinity DataIC50: >4.00E+4nM. Assay description: NIH Molecular Libraries Screening Centers Network [MLSCN] Emory Chemical Biology Discovery Center in MLSCN Assay provider: F.M. Hoffmann, University ...
In DepthDetails PCBioAssay