BDBM41996 6-iodanyl-3a,4,5,9b-tetrahydro-3H-cyclopenta[c]quinoline-4-carboxylic acid::6-iodo-3a,4,5,9b-tetrahydro-3H-cyclopenta[c]quinoline-4-carboxylic acid::MLS-0092009.0001::cid_3439114
SMILES OC(=O)C1Nc2c(I)cccc2C2C=CCC12
InChI Key InChIKey=CNQHYGCDWZHJEN-UHFFFAOYSA-N
Data  4 IC50
  Tab Delimited (TSV)   2D SDfile   Computed 3D by Vconf -m prep SDfile
Find this compound or compounds like it in BindingDB:
Activity Spreadsheet -- Enzyme Inhibition Constant Data from BindingDB
Found 4 hits for monomerid = 41996
TargetHeat shock 70 kDa protein 1A(Homo sapiens (Human))
Burnham Center For Chemical Genomics
Curated by PubChem BioAssay
LigandPNGBDBM41996(6-iodanyl-3a,4,5,9b-tetrahydro-3H-cyclopenta[c]qui...)
Affinity DataIC50:  3.13E+3nM. Assay description: Sanford-Burnham Center for Chemical Genomics (SBCCG) Sanford-Burnham Medical Research Institute (SBMRI, San Diego, CA) NIH Molecular Libraries Screen...
In DepthDetails PCBioAssay
TargetHeat shock cognate 71 kDa protein(Homo sapiens (Human))
Sanford-Burnham Center For Chemical Genomics
Curated by PubChem BioAssay
LigandPNGBDBM41996(6-iodanyl-3a,4,5,9b-tetrahydro-3H-cyclopenta[c]qui...)
Affinity DataIC50:  1.41E+4nM. Assay description: Data Source: Sanford-Burnham Center for Chemical Genomics (SBCCG) Source Affiliation: Sanford-Burnham Medical Research Institute (SBMRI, San Diego, C...
In DepthDetails PCBioAssay
TargetTyrosine-protein phosphatase non-receptor type 7(Homo sapiens (Human))
Burnham Center For Chemical Genomics
Curated by PubChem BioAssay
LigandPNGBDBM41996(6-iodanyl-3a,4,5,9b-tetrahydro-3H-cyclopenta[c]qui...)
Affinity DataIC50: >1.00E+5nM. Assay description: Data Source: Sanford-Burnham Center for Chemical Genomics (SBCCG) Source Affiliation: Sanford-Burnham Medical Research Institute (SBMRI, San Diego, C...
In DepthDetails PCBioAssay
TargetGlyceraldehyde-3-phosphate dehydrogenase(Homo sapiens (Human))
Sanford-Burnham Center For Chemical Genomics
Curated by PubChem BioAssay
LigandPNGBDBM41996(6-iodanyl-3a,4,5,9b-tetrahydro-3H-cyclopenta[c]qui...)
Affinity DataIC50:  4.78E+4nM. Assay description: Data Source: Sanford-Burnham Center for Chemical Genomics (SBCCG) Source Affiliation: Sanford-Burnham Medical Research Institute (SBMRI, San Diego, C...
In DepthDetails PCBioAssay