BDBM42028 (3aS,4R,9bR)-6-chloranyl-4-(4-morpholin-4-ylsulfonylphenyl)-3a,4,5,9b-tetrahydro-3H-cyclopenta[c]quinoline-8-carboxylic acid::(3aS,4R,9bR)-6-chloro-4-(4-morpholin-4-ylsulfonylphenyl)-3a,4,5,9b-tetrahydro-3H-cyclopenta[c]quinoline-8-carboxylic acid::(3aS,4R,9bR)-6-chloro-4-(4-morpholinosulfonylphenyl)-3a,4,5,9b-tetrahydro-3H-cyclopenta[c]quinoline-8-carboxylic acid::(3aS,4R,9bR)-6-chloro-4-[4-(4-morpholinylsulfonyl)phenyl]-3a,4,5,9b-tetrahydro-3H-cyclopenta[c]quinoline-8-carboxylic acid::MLS000705473::SMR000230901::cid_15945793
SMILES OC(=O)c1cc(Cl)c2N[C@H]([C@H]3CC=C[C@H]3c2c1)c1ccc(cc1)S(=O)(=O)N1CCOCC1
InChI Key InChIKey=IMTBEAHKSQDZEG-LQWHRVPQSA-N
Data  4 EC50
  Tab Delimited (TSV)   2D SDfile   Computed 3D by Vconf -m prep SDfile
Find this compound or compounds like it in BindingDB:
Activity Spreadsheet -- Enzyme Inhibition Constant Data from BindingDB
Found 4 hits for monomerid = 42028
TargetEstrogen receptor(Homo sapiens (Human))
Nmmlsc
Curated by PubChem BioAssay
LigandPNGBDBM42028((3aS,4R,9bR)-6-chloranyl-4-(4-morpholin-4-ylsulfon...)
Affinity DataEC50:  1.01E+3nM. Assay description: University of New Mexico Assay Overview: Assay Support: 1X01 MH077627-01 Assay for Ligands of GPR30 and Classical Estrogen Receptors PI: Eric Prossni...
In DepthDetails PCBioAssay
TargetZinc finger protein mex-5(Caenorhabditis elegans)
Broad Institute
Curated by PubChem BioAssay
LigandPNGBDBM42028((3aS,4R,9bR)-6-chloranyl-4-(4-morpholin-4-ylsulfon...)
Affinity DataEC50:  2.97E+4nM. Assay description: Broad Institute: MLPCN maternal gene expression Project ID: 2024 Keywords: Zinc finger, C. elegans, maternal gene expression, RNA-protein interac...
In DepthDetails PCBioAssay
TargetPOsterior Segregation(Caenorhabditis elegans)
Broad Institute
Curated by PubChem BioAssay
LigandPNGBDBM42028((3aS,4R,9bR)-6-chloranyl-4-(4-morpholin-4-ylsulfon...)
Affinity DataEC50:  3.00E+5nM. Assay description: Broad Institute: MLPCN maternal gene expression Project ID: 2024 Keywords: Zinc finger, C. elegans, maternal gene expression, RNA-protein interac...
In DepthDetails PCBioAssay
TargetEstrogen receptor beta(Homo sapiens (Human))
Nmmlsc
Curated by PubChem BioAssay
LigandPNGBDBM42028((3aS,4R,9bR)-6-chloranyl-4-(4-morpholin-4-ylsulfon...)
Affinity DataEC50:  729nM. Assay description: University of New Mexico Assay Overview: Assay Support: 1X01 MH077627-01 Assay for Ligands of GPR30 and Classical Estrogen Receptors PI: Eric Prossni...
In DepthDetails PCBioAssay