BDBM420304 LLL-12
SMILES NS(=O)(=O)c1cccc2C(=O)c3c(O)cccc3C(=O)c12
InChI Key InChIKey=CQBHSRLUQDYPBU-UHFFFAOYSA-N
Data  3 IC50
  Tab Delimited (TSV)   2D SDfile   Computed 3D by Vconf -m prep SDfile
Find this compound or compounds like it in BindingDB:
Activity Spreadsheet -- Enzyme Inhibition Constant Data from BindingDB
Found 3 hits for monomerid = 420304
TargetReplicase polyprotein 1ab(2019-nCoV)
National Institutes Of Health
LigandPNGBDBM420304(LLL-12)
Affinity DataIC50:  9.84E+3nM. Assay description: The 3CLpro enzyme assay was developed in 384-well black, medium binding microplates (Greiner Bio-One, Monroe, NC, USA) with a total volume of 20 _...
Ligand InfoPurchase
In DepthDetails ArticlePubMed
TargetSignal transducer and activator of transcription 3(Homo sapiens (Human))
Fudan University
Curated by ChEMBL
LigandPNGBDBM420304(LLL-12)
Affinity DataIC50:  98nM. Assay description: Inhibition of IL-6 induced STAT3 transcriptional activity in human HepG2 cells incubated for 1 hr followed by stimulation with IL-6 for 5.5 hrs by lu...
Ligand InfoPurchase
In DepthDetails ArticlePubMed
TargetReplicase polyprotein 1ab(2019-nCoV)
National Institutes Of Health
LigandPNGBDBM420304(LLL-12)
Affinity DataIC50:  9.84E+3nM. Assay description: This is a review article. Please point to the original journal.
Ligand InfoPurchase
In DepthDetails ArticlePubMed