BDBM420314 4E1-RCat::4E1RCat
SMILES OC(=O)c1ccc(cc1)N1C(=O)C(=Cc2ccc(o2)-c2ccc(cc2)[N+]([O-])=O)C=C1c1ccccc1
InChI Key InChIKey=BBQRBOIMSKMFFO-LTGZKZEYSA-N
Data  2 IC50
  Tab Delimited (TSV)   2D SDfile   Computed 3D by Vconf -m prep SDfile
Find this compound or compounds like it in BindingDB:
Activity Spreadsheet -- Enzyme Inhibition Constant Data from BindingDB
Found 2 hits for monomerid = 420314
TargetReplicase polyprotein 1ab(2019-nCoV)
Michigan State University
LigandPNGBDBM420314(4E1-RCat | 4E1RCat)
Affinity DataIC50:  1.83E+4nM. Assay description: This is a review article. Please point to the original journal.
Ligand InfoPurchase
In DepthDetails ArticlePubMed
TargetReplicase polyprotein 1ab(2019-nCoV)
Michigan State University
LigandPNGBDBM420314(4E1-RCat | 4E1RCat)
Affinity DataIC50:  1.83E+4nM. Assay description: The 3CLpro enzyme assay was developed in 384-well black, medium binding microplates (Greiner Bio-One, Monroe, NC, USA) with a total volume of 20 _...
Ligand InfoPurchase
In DepthDetails ArticlePubMed