BDBM421423 N-(1-Methylcyclopropyl)-1-[2-(2-oxooxazolidin-3-yl)acetyl]indoline-6-sulfonamide::US10508086, Example 14::US10995073, Example 14
SMILES CC1(CC1)NS(=O)(=O)c1ccc2CCN(C(=O)CN3CCOC3=O)c2c1
InChI Key InChIKey=QMHBFTDPSONVFY-UHFFFAOYSA-N
Data  4 IC50  2 EC50
  Tab Delimited (TSV)   2D SDfile   Computed 3D by Vconf -m prep SDfile
Find this compound or compounds like it in BindingDB:
Activity Spreadsheet -- Enzyme Inhibition Constant Data from BindingDB
Found 6 hits for monomerid = 421423
TargetPoly(ADP-ribose) glycohydrolase(Homo sapiens (Human))
Cancer Research Technology
US Patent
LigandPNGBDBM421423(N-(1-Methylcyclopropyl)-1-[2-(2-oxooxazolidin-3-yl...)
Affinity DataEC50:  4.28E+3nM. Assay description: PARG In vitro assays were conducted in a total volume of 15 ul in a standard 384 well format. 5 ul of Human Full Length PARG (Produced internally by ...
Ligand InfoPC cidPC sid
In DepthDetails US Patent
TargetADP-ribosylhydrolase ARH3(Homo sapiens (Human))
Cancer Research Technology
US Patent
LigandPNGBDBM421423(N-(1-Methylcyclopropyl)-1-[2-(2-oxooxazolidin-3-yl...)
Affinity DataIC50: >1.50E+5nM. Assay description: ARH3 In vitro selectivity assays were conducted in a total volume of 15 ul in a standard 384 well format. 5 ul of Human Full Length ARH3 (Enzo Life S...
Ligand InfoPC cidPC sid
In DepthDetails US Patent
TargetPoly [ADP-ribose] polymerase 1(Homo sapiens (Human))
Cancer Research Technology
US Patent
LigandPNGBDBM421423(N-(1-Methylcyclopropyl)-1-[2-(2-oxooxazolidin-3-yl...)
Affinity DataIC50: >1.50E+5nM. Assay description: PARP1 In vitro selectivity assays were conducted as a 10 ul reaction volume in a NUNC Maxisorp 384-well assay plate pre-coated in-house with Histones...
Ligand InfoPC cidPC sid
In DepthDetails US Patent
TargetPoly(ADP-ribose) glycohydrolase(Homo sapiens (Human))
Cancer Research Technology
US Patent
LigandPNGBDBM421423(N-(1-Methylcyclopropyl)-1-[2-(2-oxooxazolidin-3-yl...)
Affinity DataEC50:  4.28E+3nM. Assay description: PARG In vitro assays were conducted in a total volume of 15 ul in a standard 384 well format. 5 ul of Human Full Length PARG (Produced internally by ...
Ligand InfoPC cidPC sid
In DepthDetails US Patent
TargetADP-ribosylhydrolase ARH3(Homo sapiens (Human))
Cancer Research Technology
US Patent
LigandPNGBDBM421423(N-(1-Methylcyclopropyl)-1-[2-(2-oxooxazolidin-3-yl...)
Affinity DataIC50: >1.50E+5nM. Assay description: ARH3 In vitro selectivity assays were conducted in a total volume of 15 ul in a standard 384 well format. 5 ul of Human Full Length ARH3 (Enzo Life S...
Ligand InfoPC cidPC sid
In DepthDetails US Patent
TargetPoly [ADP-ribose] polymerase 1(Homo sapiens (Human))
Cancer Research Technology
US Patent
LigandPNGBDBM421423(N-(1-Methylcyclopropyl)-1-[2-(2-oxooxazolidin-3-yl...)
Affinity DataIC50: >1.50E+5nM. Assay description: PARP1 In vitro selectivity assays were conducted as a 10 ul reaction volume in a NUNC Maxisorp 384-well assay plate pre-coated in-house with Histones...
Ligand InfoPC cidPC sid
In DepthDetails US Patent