BDBM42147 4-[2-[4-(2-furoyl)piperazino]acetyl]-9-hydroxy-2,3-dihydro-1H-chromeno[3,4-b]pyridin-5-one::4-[2-[4-(furan-2-carbonyl)piperazin-1-yl]acetyl]-9-hydroxy-2,3-dihydro-1H-chromeno[3,4-b]pyridin-5-one::4-[2-[4-(furan-2-ylcarbonyl)piperazin-1-yl]ethanoyl]-9-oxidanyl-2,3-dihydro-1H-chromeno[3,4-b]pyridin-5-one::4-[2-[4-[2-furanyl(oxo)methyl]-1-piperazinyl]-1-oxoethyl]-9-hydroxy-2,3-dihydro-1H-[1]benzopyrano[3,4-b]pyridin-5-one::4-{[4-(2-furoyl)piperazin-1-yl]acetyl}-9-hydroxy-1,2,3,4-tetrahydro-5H-chromeno[3,4-b]pyridin-5-one::MLS000043269::SMR000019889::cid_3237512
SMILES Oc1ccc2oc(=O)c3N(CCCc3c2c1)C(=O)CN1CCN(CC1)C(=O)c1ccco1
InChI Key InChIKey=AJERDRQVIHTABL-UHFFFAOYSA-N
Data  3 IC50
  Tab Delimited (TSV)   2D SDfile   Computed 3D by Vconf -m prep SDfile
Find this compound or compounds like it in BindingDB:
Activity Spreadsheet -- Enzyme Inhibition Constant Data from BindingDB
Found 3 hits for monomerid = 42147
TargetTyrosine-protein phosphatase YopH(Yersinia enterocolitica)
University Of Pittsburgh
Curated by PubChem BioAssay
LigandPNGBDBM42147(4-[2-[4-(2-furoyl)piperazino]acetyl]-9-hydroxy-2,3...)
Affinity DataIC50: >5.00E+4nM. Assay description: Yersinia pestis is the causal agent of the bubonic plague and, although modern antibiotics are extremely effective against the malady, the plague rem...
In DepthDetails PCBioAssay
TargetTyrosine-protein phosphatase YopH(Yersinia enterocolitica)
University Of Pittsburgh
Curated by PubChem BioAssay
LigandPNGBDBM42147(4-[2-[4-(2-furoyl)piperazino]acetyl]-9-hydroxy-2,3...)
Affinity DataIC50: >5.00E+4nM. Assay description: Yersinia pestis is the causal agent of the bubonic plague and, although modern antibiotics are extremely effective against the malady, the plague rem...
In DepthDetails PCBioAssay
TargetTyrosine-protein phosphatase YopH(Yersinia enterocolitica)
University Of Pittsburgh
Curated by PubChem BioAssay
LigandPNGBDBM42147(4-[2-[4-(2-furoyl)piperazino]acetyl]-9-hydroxy-2,3...)
Affinity DataIC50: >5.00E+4nM. Assay description: Yersinia pestis is the causal agent of the bubonic plague and, although modern antibiotics are extremely effective against the malady, the plague rem...
In DepthDetails PCBioAssay