BDBM42160 5-methyl-3-phenyl-N-(2-pyridinylmethyl)-4-isoxazolecarboxamide::5-methyl-3-phenyl-N-(2-pyridylmethyl)isoxazole-4-carboxamide::5-methyl-3-phenyl-N-(pyridin-2-ylmethyl)-1,2-oxazole-4-carboxamide::MLS000061727::SMR000070196::cid_700862
SMILES Cc1onc(c1C(=O)NCc1ccccn1)-c1ccccc1
InChI Key InChIKey=FPWJGZHLZNOSBM-UHFFFAOYSA-N
Data  3 IC50
  Tab Delimited (TSV)   2D SDfile   Computed 3D by Vconf -m prep SDfile
Find this compound or compounds like it in BindingDB:
Activity Spreadsheet -- Enzyme Inhibition Constant Data from BindingDB
Found 3 hits for monomerid = 42160
TargetTyrosine-protein phosphatase YopH(Yersinia enterocolitica)
University Of Pittsburgh
Curated by PubChem BioAssay
LigandPNGBDBM42160(5-methyl-3-phenyl-N-(2-pyridinylmethyl)-4-isoxazol...)
Affinity DataIC50: >5.00E+4nM. Assay description: Yersinia pestis is the causal agent of the bubonic plague and, although modern antibiotics are extremely effective against the malady, the plague rem...
In DepthDetails PCBioAssay
TargetTyrosine-protein phosphatase YopH(Yersinia enterocolitica)
University Of Pittsburgh
Curated by PubChem BioAssay
LigandPNGBDBM42160(5-methyl-3-phenyl-N-(2-pyridinylmethyl)-4-isoxazol...)
Affinity DataIC50: >5.00E+4nM. Assay description: Yersinia pestis is the causal agent of the bubonic plague and, although modern antibiotics are extremely effective against the malady, the plague rem...
In DepthDetails PCBioAssay
TargetTyrosine-protein phosphatase YopH(Yersinia enterocolitica)
University Of Pittsburgh
Curated by PubChem BioAssay
LigandPNGBDBM42160(5-methyl-3-phenyl-N-(2-pyridinylmethyl)-4-isoxazol...)
Affinity DataIC50: >5.00E+4nM. Assay description: Yersinia pestis is the causal agent of the bubonic plague and, although modern antibiotics are extremely effective against the malady, the plague rem...
In DepthDetails PCBioAssay